{"text_format":"1","workbook":"xlsx","n_sheets":7,"sheets":["PrintPage","EntryForm","Selection&DATE_Entry","KANA-Palette","Master_Lists","Master_ProductCode","Master_Names"],"not_rendered":{"charts":0,"images":0,"macros":1,"external_links":2,"defined_names":26,"comments":2,"pivot_tables":0},"unopened":[],"bounds":{"document_bytes":16777216,"sheet_cells":100000,"rows_first":2000,"rows_last":500,"rows_between":2000,"halvings":0,"cell_chars":16384,"cell_head_chars":4096},"cells_cut":0,"cells_raw":0,"read":"whole","date_system":"1900"}

{"sheet":"PrintPage","index":0,"n_rows":26,"n_cols":26,"rows_kept":26,"cut":false,"hidden":false,"merged":[[25,12,25,23],[6,1,6,3],[7,1,7,3],[11,24,11,25],[11,20,11,23],[11,16,11,19],[9,1,9,3],[10,1,10,3],[11,1,11,3],[24,7,24,25],[23,7,23,11],[23,15,23,25],[15,8,15,10],[16,7,16,13],[14,10,14,12],[13,1,13,3],[5,12,5,19],[0,2,0,3],[0,4,0,25],[3,12,3,13],[3,6,3,8],[3,1,3,2],[1,16,2,25],[3,14,3,15],[1,1,2,5],[1,6,2,11],[1,12,2,15],[13,24,13,25],[13,16,13,17],[13,18,13,19],[11,5,11,7],[13,22,13,23],[13,10,13,13],[12,5,12,7],[14,6,14,9],[13,20,13,21],[16,4,16,5],[16,1,16,2],[15,4,15,5],[14,1,14,2],[15,1,15,3],[13,14,13,15],[13,6,13,9],[12,1,12,3],[4,1,4,11],[3,16,3,25],[5,9,5,10],[12,20,12,22],[12,16,12,18],[4,12,4,19],[4,20,4,25],[11,8,11,13],[12,8,12,13],[11,14,11,15],[8,1,8,3],[5,20,5,25],[5,1,5,7],[9,17,9,20],[7,17,7,20],[21,1,21,25],[22,1,22,25],[17,1,17,25],[18,1,18,25],[19,1,19,25],[20,1,20,25]]}
[null,"No.",{"$f":"EntryForm!C1:C1","v":"00959"},null,"                                                      EXPORT CERTIFICATE"]
[null,"License number",null,null,null,null,"Last reg. Date",null,null,null,null,null,"First reg. Month",null,null,null,"Frame number"]
[]
[null,{"$f":"EntryForm!B3","v":"KITAKYUSHU"},null,{"$f":"EntryForm!D3","v":399},{"$f":"EntryForm!F3","v":"TU"},{"$f":"EntryForm!G3","v":8270},{"$f":"EntryForm!H3","v":{"$error":"#N/A"}},null,null,{"$f":"EntryForm!K3","v":15},",",{"$f":"EntryForm!N3","v":2024},{"$f":"EntryForm!O3","v":"August,"},null,{"$f":"EntryForm!Q3","v":2010},null,{"$f":"EntryForm!S3","v":"WBAPH36070NM65102"}]
[null,"Name",null,null,null,null,null,null,null,null,null,null,"Model",null,null,null,null,null,null,null,"Engine model"]
[null,"TMT",null,null,null,null,null,null,"[",{"$f":"EntryForm!K5","v":"771"},null,"]",{"$f":"EntryForm!O5","v":"LBA-PH25"},null,null,null,null,null,null,null,{"$f":"EntryForm!W5","v":"N53B30A"}]
[null,"Last owner's name",null,null,{"$f":"EntryForm!F6","v":"IBC JAPAN KABUSHIKIGAISHA"}]
[null,"Above address ",null,null,{"$f":"EntryForm!F7","v":"KYOTO-FU KYOTO-SHI FUSHIMI-KU NAKAJIMA MIYANOMAE-CHO 64"}]
[null,"Last user's name",null,null,{"$f":"EntryForm!F8","v":"*******"}]
[null,"Above address",null,null,{"$f":"EntryForm!F9","v":"*******"}]
[null,"Above location",null,null,{"$f":"EntryForm!F10","v":"*******"}]
[null,"Category",null,null,"Purpose of use","Private or commercial",null,null,"Style of Vehicle",null,null,null,null,null,"Personal capacity",null,"Cargo capacity",null,null,null,"Net weight",null,null,null,"Gross weight"]
[null,{"$f":"EntryForm!B12","v":"MEDIUM"},null,null,{"$f":"EntryForm!F12","v":"Passenger"},{"$f":"EntryForm!G12","v":"PRIVATE"},null,null,{"$f":"EntryForm!J12","v":"SEDAN"},null,null,null,null,null,{"$f":"EntryForm!Q12","v":5},"people",{"$f":"EntryForm!S12","v":0},null,null,"kg",{"$f":"EntryForm!W12","v":1560},null,null,"kg",{"$f":"EntryForm!AA12","v":1835},"kg"]
[null,"Displacement or outputpower",null,null,"Fuel","Type No.","Code no.",null,null,null,"Length",null,null,null,"Width",null,"Height",null,"F.F wight",null,"F.R. weight",null,"R.F. weight",null,"R.R. weight"]
[null,{"$f":"EntryForm!B14","v":"2.99"},null,"kw                  L",{"$f":"EntryForm!F14","v":"PETROL"},{"$f":"EntryForm!G14","v":"16530"},{"$f":"EntryForm!H14","v":"0004"},null,null,null,{"$f":"EntryForm!L14","v":454},null,null,"cm",{"$f":"EntryForm!Q14","v":180},"cm",{"$f":"EntryForm!S14","v":142},"cm",{"$f":"EntryForm!U14","v":800},"kg",{"$f":"EntryForm!W14","v":0},"kg",{"$f":"EntryForm!Y14","v":0},"kg",{"$f":"EntryForm!AA14","v":760},"kg"]
[null,"EXPIRY DATE",null,null,{"$f":"EntryForm!F15","v":"October,"},null,{"$f":"EntryForm!H15","v":23},",",{"$f":"EntryForm!K15","v":2024}]
[null,"REMARK:",null,"[","KYOTO",null,"]"]
[]
[]
[]
[]
[]
[]
[null,null,null,null,null,null,null,{"$f":"EntryForm!I21","v":"April,"},null,null,null,null,{"$f":"EntryForm!O21","v":24},",",{"$f":"EntryForm!Q21","v":2024},"KYOTO UNYU SHIKYOKU-CHO"]
[null,null,null,null,null,null,null,"We IBC JAPAN LTD. verify that this English translation of                                                                                                 Certificate Registration is exactly the same with the original Japanese edition"]
[null,null,null,null,null,null,null,null,null,null,null,null,{"$f":"EntryForm!O24","v":0}]

{"sheet":"EntryForm","index":1,"n_rows":23,"n_cols":28,"rows_kept":23,"cut":false,"hidden":false,"merged":[[20,17,20,27],[20,8,20,13],[20,1,23,7],[21,8,21,27],[23,8,23,13],[23,24,23,27],[22,8,22,27],[23,14,23,23],[12,26,12,27],[13,7,13,10],[13,11,13,14],[12,24,12,25],[15,8,15,15],[14,7,14,8],[14,10,14,12],[14,1,14,4],[14,5,14,6],[15,1,15,2],[13,1,13,3],[11,18,11,20],[15,5,15,6],[11,22,11,24],[12,1,12,4],[12,7,12,10],[12,11,12,15],[12,16,12,17],[12,18,12,19],[12,20,12,21],[12,22,12,23],[11,1,11,4],[11,6,11,8],[11,9,11,15],[11,16,11,17],[10,16,10,17],[10,18,10,21],[10,22,10,25],[10,26,10,27],[5,1,5,4],[6,1,6,4],[6,22,6,26],[7,1,7,4],[8,22,8,26],[8,1,8,4],[9,1,9,4],[10,1,10,4],[10,6,10,8],[10,9,10,15],[4,1,4,8],[4,14,4,21],[4,22,4,27],[4,11,4,13],[3,1,3,13],[3,14,3,21],[3,22,3,27],[2,18,2,27],[0,2,0,4],[0,5,0,27],[1,1,1,6],[1,7,1,13],[1,14,1,17],[1,18,1,27],[2,1,2,2],[2,7,2,9],[2,14,2,15],[2,16,2,17],[2,3,2,4],[2,10,2,11]]}
[null,"No.","00959",null,null,"                                            EXPORT CERTIFICATE"]
[null,"License number",null,null,null,null,null,"Last reg. Date",null,null,null,null,null,null,"First reg. Month",null,null,null,"Frame number"]
[null,{"$f":"'Selection&DATE_Entry'!H3","v":"KITAKYUSHU"},null,399,null,"TU",8270,{"$f":"'Selection&DATE_Entry'!I15","v":{"$error":"#N/A"}},null,null,{"$f":"'Selection&DATE_Entry'!J15","v":15},null,",",{"$f":"'Selection&DATE_Entry'!H15","v":2024},{"$f":"'Selection&DATE_Entry'!I18","v":"August,"},null,{"$f":"'Selection&DATE_Entry'!H18","v":2010},null,"WBAPH36070NM65102"]
[null,"Name",null,null,null,null,null,null,null,null,null,null,null,null,"Model",null,null,null,null,null,null,null,"Engine model"]
[null,{"$f":"VLOOKUP(K5,Master_ProductCode!B4:C1002,2,FALSE)","v":"BMW"},null,null,null,null,null,null,null,"[","771","]",null,null,"LBA-PH25",null,null,null,null,null,null,null,"N53B30A"]
[null,"Last owner's name",null,null,null,"IBC JAPAN KABUSHIKIGAISHA"]
[null,"Above address ",null,null,null,"KYOTO-FU KYOTO-SHI FUSHIMI-KU NAKAJIMA MIYANOMAE-CHO 64",null,null,null,null,null,null,null,null,null,null,null,null,null,null,null,null,"Go To Address Seacher"]
[null,"Last user's name",null,null,null,"*******"]
[null,"Above address",null,null,null,"*******",null,null,null,null,null,null,null,null,null,null,null,null,null,null,null,null,"Go To Address Seacher"]
[null,"Above location",null,null,null,"*******"]
[null,"Category",null,null,null,"Purpose of use","Private or commercial",null,null,"Style of Vehicle",null,null,null,null,null,null,"Personal capacity",null,"Cargo capacity",null,null,null,"Net weight",null,null,null,"Gross weight"]
[null,{"$f":"'Selection&DATE_Entry'!H5","v":"MEDIUM"},null,null,null,{"$f":"'Selection&DATE_Entry'!L9","v":"Passenger"},{"$f":"'Selection&DATE_Entry'!H7","v":"PRIVATE"},null,null,{"$f":"'Selection&DATE_Entry'!H9","v":"SEDAN"},null,null,null,null,null,null,5,null,null,null,null,"kg",1560,null,null,null,1835,"kg"]
[null,"Displacement or outputpower",null,null,null,"Fuel","Type No.","Code no.",null,null,null,"Length",null,null,null,null,"Width",null,"Height",null,"F.F wight",null,"F.R. weight",null,"R.F. weight",null,"R.R. weight"]
[null,"2.99",null,null,"kw                  L",{"$f":"'Selection&DATE_Entry'!H11","v":"PETROL"},"16530","0004",null,null,null,454,null,null,null,"cm",180,"cm",142,"cm",800,"kg",null,"kg",null,"kg",{"$f":"W12-U14","v":760},"kg"]
[null,"EXPIRY DATE",null,null,null,{"$f":"'Selection&DATE_Entry'!I21","v":"October,"},null,{"$f":"'Selection&DATE_Entry'!J21","v":23},null,",",{"$f":"'Selection&DATE_Entry'!H21","v":2024}]
[null,"REMARK:",null,null,"[",null,null,"]"]
[]
[]
[]
[]
[null,null,null,null,null,null,null,null,{"$f":"'Selection&DATE_Entry'!I24","v":"April,"},null,null,null,null,null,{"$f":"'Selection&DATE_Entry'!J24","v":24},",",{"$f":"'Selection&DATE_Entry'!H24","v":2024}]
[null,null,null,null,null,null,null,null,"                    We IBC JAPAN LTD. verify that this English translation of                                                                                                 Certificate Registration is"]
[null,null,null,null,null,null,null,null," exactly the same with the original Japanese edition"]

{"sheet":"Selection&DATE_Entry","index":2,"n_rows":24,"n_cols":13,"rows_kept":24,"cut":false,"hidden":false,"merged":[[7,11,7,12],[8,11,8,12],[4,7,4,12],[5,6,5,12],[6,7,6,12],[7,6,7,10],[0,1,0,12],[15,10,17,10],[15,11,17,11],[15,12,17,12],[16,1,17,1],[12,1,12,5],[15,1,15,5],[1,1,1,5],[2,1,2,2],[1,11,1,12],[2,11,2,12],[1,6,1,10],[2,7,2,10],[2,3,2,5],[3,6,3,12],[8,7,8,10],[9,1,9,5],[10,1,10,2],[13,6,13,7],[16,6,16,7],[10,7,10,12],[11,1,11,9],[13,1,14,1],[9,6,9,12],[22,10,23,10],[22,11,23,11],[10,3,10,5],[16,2,17,2],[16,3,16,5],[12,6,12,9],[15,6,15,9],[13,2,14,2],[13,3,13,5],[20,10,20,12],[22,12,23,12],[22,6,22,7],[17,4,17,5],[12,10,13,12],[18,6,18,9],[21,6,21,9],[19,6,19,7],[16,8,16,9],[17,8,17,9],[14,10,14,12],[21,10,21,12],[4,3,4,5],[6,3,6,5],[8,3,8,5],[3,1,3,5],[4,1,4,2],[5,1,5,5],[6,1,6,2],[7,1,7,5],[8,1,8,2],[19,1,20,1],[18,1,18,5],[22,2,23,2],[22,3,22,5],[22,1,23,1],[21,1,21,5],[19,2,20,2],[19,3,19,5]]}
[null,"Selection Form"]
[null,"自動車登録番号",null,null,null,null,"License Number",null,null,null,null,"Issued / Authorized Name by;"]
[null,"Registered Place",null,"北九州",null,null,"→",{"$f":"VLOOKUP(D3,Master_Lists!B3:C119,2,FALSE)","v":"KITAKYUSHU"},null,null,null,{"$f":"VLOOKUP(H3,Master_Lists!C3:D119,2,FALSE)","v":"HUKUOKA UNYU SHIKYOKU-CHO"}]
[null,"自動車の種別",null,null,null,null,"Category"]
[null,"Category",null,"普　通",null,null,"→",{"$f":"VLOOKUP(D5,Master_Lists!G26:H28,2,FALSE)","v":"MEDIUM"}]
[null,"自家用・事業用の別／適否",null,null,null,null,"Private / Commercial"]
[null,"Private or Commercial",null,"自家用",null,null,"→",{"$f":"VLOOKUP(D7,Master_Lists!G33:H34,2,FALSE)","v":"PRIVATE"}]
[null,"車体の形状",null,null,null,null,"Style of Vehicle",null,null,null,null,"Purpose of Use"]
[null,"Style of Vehicle",null,"箱型",null,null,"→",{"$f":"VLOOKUP(D9,Master_Lists!G3:H22,2,FALSE)","v":"SEDAN"},null,null,null,{"$f":"VLOOKUP(H9,Master_Lists!H3:I22,2,FALSE)","v":"Passenger"}]
[null,"燃料の種別",null,null,null,null,"Fuel"]
[null,"Fuel",null,"ガソリン",null,null,"→",{"$f":"VLOOKUP(D11,Master_Lists!G40:H41,2,FALSE)","v":"PETROL"}]
[null,"DATA Entry Form"]
[null,"登録年月日／交付年月日",null,null,null,null,"Last Registered Date",null,null,null,"Last owner's name"]
[null,"①","Last Reg.Date","平成",null,null,"Year",null,"Month","Day"]
[null,null,null,36,24,15,"→",{"$f":"D15+1988","v":2024},{"$f":"VLOOKUP(E15,Master_Lists!F46:G57,2,FALSE)","v":{"$error":"#N/A"}},{"$f":"F15","v":15},"Put 3 digits from 001 to 100"]
[null,2,null,null,null,null,"First Registered Month",null,null,null,null,"→",{"$f":"VLOOKUP(K16,Master_Names!B3:C102,2,FALSE)","v":{"$error":"#N/A"}}]
[null,"②","First Reg. Month / Year","平成",null,null,"Year",null,"Month"]
[null,null,null,22,8,null,"→",{"$f":"D18+1988","v":2010},{"$f":"VLOOKUP(E18,Master_Lists!F46:G57,2,FALSE)","v":"August,"}]
[null,"有効期間の満了する日",null,null,null,null,"EXPIRY DATE"]
[null,"③","Expiry Date","平成",null,null,"Year",null,"Month","Day"]
[null,null,null,36,10,23,"→",{"$f":"D21+1988","v":2024},{"$f":"VLOOKUP(E21,Master_Lists!F46:G57,2,FALSE)","v":"October,"},{"$f":"F21","v":23},"Last user's name"]
[null,"(Date of Issued)",null,null,null,null,"Date",null,null,null,"Put 3 digits from 001 to 100"]
[null,"④","Date","平成",null,null,"Year",null,"Month","Day",null,"→",{"$f":"VLOOKUP(K23,Master_Names!B3:C102,2,FALSE)","v":{"$error":"#N/A"}}]
[null,null,null,36,4,24,"→",{"$f":"D24+1988","v":2024},{"$f":"VLOOKUP(E24,Master_Lists!F46:G57,2,FALSE)","v":"April,"},{"$f":"F24","v":24}]

{"sheet":"KANA-Palette","index":3,"n_rows":12,"n_cols":15,"rows_kept":12,"cut":false,"hidden":false,"merged":[]}
[]
[null,"あ","A",null,"か","KA",null,"さ","SA",null,"た","TA",null,"な","NA"]
[null,"い","I",null,"き","KI",null,"し","SHI",null,"ち","CHI",null,"に","NI"]
[null,"う","U",null,"く","KU",null,"す","SU",null,"つ","TU",null,"ぬ","NU"]
[null,"え","E",null,"け","KE",null,"せ","SE",null,"て","TE",null,"ね","NE"]
[null,"お","O",null,"こ","KO",null,"そ","SO",null,"と","TO",null,"の","NO"]
[]
[null,"は","HA",null,"ま","MA",null,"や","YA",null,"ら","RA",null,"わ","WA"]
[null,"ひ","HI",null,"み","MI",null,"ゆ","YU",null,"り","RI",null,"を","WO"]
[null,"ふ","FU",null,"む","MU",null,"よ","YO",null,"る","RU",null,"ん","N"]
[null,"へ","HE",null,"め","ME",null,null,null,null,"れ","RE"]
[null,"ほ","HO",null,"も","MO",null,null,null,null,"ろ","RO"]

{"sheet":"Master_Lists","index":4,"n_rows":119,"n_cols":9,"rows_kept":119,"cut":false,"hidden":false,"merged":[[0,5,0,6],[24,5,24,6],[14,0,16,0],[17,0,18,0],[0,0,0,3],[2,0,8,0],[9,0,10,0],[12,0,13,0],[19,0,22,0],[34,0,39,0],[38,5,38,6],[39,5,40,5],[40,0,46,0],[25,5,27,5],[23,0,29,0],[30,0,33,0],[31,5,31,6],[32,5,33,5],[87,0,88,0],[47,0,49,0],[50,0,53,0],[54,0,56,0],[57,0,58,0],[59,0,60,0],[61,0,62,0],[65,0,67,0],[68,0,69,0],[70,0,73,0],[74,0,81,0],[82,0,85,0],[116,0,117,0],[90,0,91,0],[94,0,95,0],[97,0,98,0],[100,0,101,0],[106,0,109,0],[111,0,112,0]]}
["運輸支局一覧"]
["都道府県","表示文字","No. Plate","Author Name",null,"Code","車体の形状","Style of Vehicle","Purpose of use"]
["北海道","札幌","SAPPORO","SAPPORO UNYU SHIKYOKU-CHO",null,"001","箱型","SEDAN","Passenger"]
[null,"函館","HAKODATE","HAKODATE UNYU SHIKYOKU-CHO",null,"002","幌型","CONVERTIBLE","Passenger"]
[null,"帯広","OBIHIRO","OBIHIRO UNYU SHIKYOKU-CHO",null,"003","ステ－ションワゴン","STATION WAGON","Passenger"]
[null,"室蘭","MURORAN","MURORAN UNYU SHIKYOKU-CHO",null,"013","リヤ－エンジン","REAR ENGINE","BUS"]
[null,"釧路","KUSHIRO","KUSHIRO UNYU SHIKYOKU-CHO",null,"011","ボンネット","BONNET","CARGO"]
[null,"旭川","ASAHIKAWA","ASAHIKAWA UNYU SHIKYOKU-CHO",null,"012","キャブオ－バ－","CABOVER","CARGO"]
[null,"北見","KITAMI","KITAMI UNYU SHIKYOKU-CHO",null,"021","バン","VAN","CARGO"]
["青森","青森","AOMORI","AOMORI UNYU SHIKYOKU-CHO",null,"022","ダンプ","DUMP","CARGO"]
[null,"八戸","HACHINOHE","AOMORI UNYU SHIKYOKU-CHO",null,"023","ピックアップ","PICK UP","CARGO"]
["秋田","秋田","AKITA","AKITA UNYU SHIKYOKU-CHO",null,"520","救急車","AMBULANCE","SPECIAL"]
["山形","山形","YAMAGATA","YAMAGATA UNYU SHIKYOKU-CHO",null,"523","消防車","FIRE TRUCK","SPECIAL"]
[null,"庄内","SHONAI","YAMAGATA UNYU SHIKYOKU-CHO",null,"522","警察車","POLICE VAN","SPECIAL"]
["岩手","岩手","IWATE","IWATE UNYU SHIKYOKU-CHO",null,"570","公共応急作業車","PUBLIC FIRST-AID SERVICE VEHICLE","SPECIAL"]
[null,"平泉","HIRAIZUMI","IWATE UNYU SHIKYOKU-CHO",null,"623","教習車","DRIVING SCHOOL VEHICLE","SPECIAL"]
[null,"盛岡","MORIOKA","IWATE UNYU SHIKYOKU-CHO",null,"632","冷蔵冷凍車","FREEZER TRUCK","SPECIAL"]
["宮城","宮城","MIYAGI","MIYAGI UNYU SHIKYOKU-CHO",null,"531","車いす移動車","WHEEL CHAIR TRANSFER VEHICLE","SPECIAL"]
[null,"仙台","SENDAI","MIYAGI UNYU SHIKYOKU-CHO",null,"642","清掃車","RUBBISH COMPACTOR","SPECIAL"]
["福島","福島","FUKUSHIMA","FUKUSHIMA UNYU SHIKYOKU-CHO",null,"671","高所作業車","HEIGH PLACE SERVICE VEHICLE","SPECIAL"]
[null,"会津","AIZU","FUKUSHIMA UNYU SHIKYOKU-CHO",null,"610","キャンピング車","CAMPING VEHICLE","SPECIAL"]
[null,"郡山","KORIYAMA","FUKUSHIMA UNYU SHIKYOKU-CHO",null,"651","放送宣伝車","BROADCASTING ON-AIR VEHICLE","SPECIAL"]
[null,"いわき","IWAKI","FUKUSHIMA UNYU SHIKYOKU-CHO"]
["東京","品川","SHINAGAWA","TOKYO UNYU SHIKYOKU-CHO"]
[null,"練馬","NERIMA","TOKYO UNYU SHIKYOKU-CHO",null,"自動車の種別",null,"Category"]
[null,"杉並","SUGINAMI","TOKYO UNYU SHIKYOKU-CHO",null,null,"小　型","SMALL"]
[null,"世田谷","SETAGAYA","TOKYO UNYU SHIKYOKU-CHO",null,null,"普　通","MEDIUM"]
[null,"足立","ADACHI","TOKYO UNYU SHIKYOKU-CHO",null,null,"軽自動車","LIGHT-DUTY VEHICLE"]
[null,"多摩","TAMA","TOKYO UNYU SHIKYOKU-CHO"]
[null,"八王子","HACHIOUJI","TOKYO UNYU SHIKYOKU-CHO"]
["神奈川","横浜","YOKOHAMA","KANAGAWA UNYU SHIKYOKU-CHO"]
[null,"川崎","KAWASAKI","KANAGAWA UNYU SHIKYOKU-CHO",null,"自家用・事業用の別／適否",null,"Private or Commercial"]
[null,"相模","SAGAMI","KANAGAWA UNYU SHIKYOKU-CHO",null,null,"自家用","PRIVATE"]
[null,"湘南","SHONAN","KANAGAWA UNYU SHIKYOKU-CHO",null,null,"事業用","COMMERCIAL"]
["千葉","千葉","CHIBA","CHIBA UNYU SHIKYOKU-CHO"]
[null,"習志野","NARASHINO","CHIBA UNYU SHIKYOKU-CHO"]
[null,"成田","NARITA","CHIBA UNYU SHIKYOKU-CHO"]
[null,"柏","KASHIWA","CHIBA UNYU SHIKYOKU-CHO"]
[null,"袖ヶ浦","SODEGAURA","CHIBA UNYU SHIKYOKU-CHO",null,"燃料の種別",null,"Fuel"]
[null,"野田","NODA","CHIBA UNYU SHIKYOKU-CHO",null,null,"ガソリン","PETROL"]
["埼玉","大宮","OMIYA","SAITAMA UNYU SHIKYOKU-CHO",null,null,"軽油","DIESEL"]
[null,"川口","KAWAGUCHI","SAITAMA UNYU SHIKYOKU-CHO"]
[null,"越谷","KOSHIGAYA","SAITAMA UNYU SHIKYOKU-CHO"]
[null,"川越","KAWAGOE","SAITAMA UNYU SHIKYOKU-CHO",null,"M","Month"]
[null,"春日部","KASUKABE","SAITAMA UNYU SHIKYOKU-CHO"]
[null,"所沢","TOKOROZAWA","SAITAMA UNYU SHIKYOKU-CHO",null,1,"January,"]
[null,"熊谷","KUMAGAYA","SAITAMA UNYU SHIKYOKU-CHO",null,2,"February,"]
["茨城","水戸","MITO","IBARAGI UNYU SHIKYOKU-CHO",null,3,"March,"]
[null,"つくば","TSUKUBA","IBARAGI UNYU SHIKYOKU-CHO",null,4,"April,"]
[null,"土浦","TSUCHIURA","IBARAGI UNYU SHIKYOKU-CHO",null,5,"May,"]
["栃木","栃木","TOCHIGI","TOCHIGI UNYU SHIKYOKU-CHO",null,6,"June,"]
[null,"那須","NASU","TOCHIGI UNYU SHIKYOKU-CHO",null,7,"July,"]
[null,"とちぎ","TOCHIGI","TOCHIGI UNYU SHIKYOKU-CHO",null,8,"August,"]
[null,"宇都宮","UTSUNOMIYA","TOCHIGI UNYU SHIKYOKU-CHO",null,9,"September,"]
["群馬","群馬","GUNMA","GUNMA UNYU SHIKYOKU-CHO",null,10,"October,"]
[null,"前橋","MAEHASHI","GUNMA UNYU SHIKYOKU-CHO",null,11,"November,"]
[null,"高崎","TAKASAKI","GUNMA UNYU SHIKYOKU-CHO",null,12,"December,"]
["山梨","山梨","YAMANASHI","YAMANASHI UNYU SHIKYOKU-CHO"]
[null,"富士山","FUJISAN","YAMANASHI UNYU SHIKYOKU-CHO"]
["新潟","新潟","NIIGATA","NIIGATA UNYU SHIKYOKU-CHO"]
[null,"長岡","NAGAOKA","NIIGATA UNYU SHIKYOKU-CHO"]
["石川","石川","ISHIKAWA","ISHIKAWA UNYU SHIKYOKU-CHO"]
[null,"金沢","KANAZAWA","ISHIKAWA UNYU SHIKYOKU-CHO"]
["富山","富山","TOYAMA","TOYAMA UNYU SHIKYOKU-CHO"]
["福井","福井","FUKUI","FUKUI UNYU SHIKYOKU-CHO"]
["長野","長野","NAGANO","NAGANO UNYU SHIKYOKU-CHO"]
[null,"諏訪","SUWA","NAGANO UNYU SHIKYOKU-CHO"]
[null,"松本","MATSUMOTO","NAGANO UNYU SHIKYOKU-CHO"]
["岐阜","岐阜","GIFU","GIFU UNYU SHIKYOKU-CHO"]
[null,"飛騨","HIDA","GIFU UNYU SHIKYOKU-CHO"]
["静岡","静岡","SHIZUOKA","SHIZUOKA UNYU SHIKYOKU-CHO"]
[null,"伊豆","IZU","SHIZUOKA UNYU SHIKYOKU-CHO"]
[null,"沼津","NUMAZU","SHIZUOKA UNYU SHIKYOKU-CHO"]
[null,"浜松","HAMAMATSU","SHIZUOKA UNYU SHIKYOKU-CHO"]
["愛知","名古屋","NAGOYA","AICHI UNYU SHIKYOKU-CHO"]
[null,"岡崎","OKAZAKI","AICHI UNYU SHIKYOKU-CHO"]
[null,"豊田","TOYOTA","AICHI UNYU SHIKYOKU-CHO"]
[null,"一宮","ICHIMIYA","AICHI UNYU SHIKYOKU-CHO"]
[null,"春日井","KASUGAI","AICHI UNYU SHIKYOKU-CHO"]
[null,"尾張小牧","OWARIKOMAKI","AICHI UNYU SHIKYOKU-CHO"]
[null,"三河","MIKAWA","AICHI UNYU SHIKYOKU-CHO"]
[null,"豊橋","TOYOHASHI","AICHI UNYU SHIKYOKU-CHO"]
["大阪","大阪","OSAKA","OSAKA UNYU SHIKYOKU-CHO"]
[null,"なにわ","NANIWA","OSAKA UNYU SHIKYOKU-CHO"]
[null,"堺","SAKAI","OSAKA UNYU SHIKYOKU-CHO"]
[null,"和泉","IZUMI","OSAKA UNYU SHIKYOKU-CHO"]
["京都","京都","KYOTO","KYOTO UNYU SHIKYOKU-CHO"]
["兵庫","神戸","KOBE","KOBE UNYU KANRI BU-CHO"]
[null,"姫路","HIMEJI","KOBE UNYU KANRI BU-CHO"]
["滋賀","滋賀","SHIGA","SHIGA UNYU SHIKYOKU-CHO"]
["三重","三重","MIE","MIE UNYU SHIKYOKU-CHO"]
[null,"鈴鹿","SUZUKA","MIE UNYU SHIKYOKU-CHO"]
["奈良","奈良","NARA","NARA UNYU SHIKYOKU-CHO"]
["和歌山","和歌山","WAKAYAMA","WAKAYAMA UNYU SHIKYOKU-CHO"]
["岡山","岡山","OKAYAMA","OKAYAMA UNYU SHIKYOKU-CHO"]
[null,"倉敷","KURASHIKI","OKAYAMA UNYU SHIKYOKU-CHO"]
["鳥取","鳥取","TOTTORI","TOTTORI UNYU SHIKYOKU-CHO"]
["広島","広島","HIROSHIMA","HIROSHIMA UNYU SHIKYOKU-CHO"]
[null,"福山","FUKUYAMA","HIROSHIMA UNYU SHIKYOKU-CHO"]
["島根","島根","SHIMANE","SHIMANE UNYU SHIKYOKU-CHO"]
["山口","山口","YAMAGUCHI","YAMAGUCHI UNYU SHIKYOKU-CHO"]
[null,"下関","SHIMONOSEKI","YAMAGUCHI UNYU SHIKYOKU-CHO"]
["徳島","徳島","TOKUSHIMA","TOKUSHIMA UNYU SHIKYOKU-CHO"]
["香川","香川","KAGAWA","KAGAWA UNYU SHIKYOKU-CHO"]
["愛媛","愛媛","EHIME","EHIME UNYU SHIKYOKU-CHO"]
["高知","高知","KOCHI","KOCHI UNYU SHIKYOKU-CHO"]
["福岡","福岡","FUKUOKA","HUKUOKA UNYU SHIKYOKU-CHO"]
[null,"北九州","KITAKYUSHU","HUKUOKA UNYU SHIKYOKU-CHO"]
[null,"筑豊","CHIKUHOU","HUKUOKA UNYU SHIKYOKU-CHO"]
[null,"久留米","KURUME","HUKUOKA UNYU SHIKYOKU-CHO"]
["佐賀","佐賀","SAGA","SAGA UNYU SHIKYOKU-CHO"]
["長崎","長崎","NAGASAKI","NAGASAKI UNYU SHIKYOKU-CHO"]
[null,"佐世保","SASEBO","NAGASAKI UNYU SHIKYOKU-CHO"]
["熊本","熊本","KUMAMOTO","KUMAMOTO UNYU SHIKYOKU-CHO"]
["大分","大分","OITA","OITA UNYU SHIKYOKU-CHO"]
["宮崎","宮崎","MIYAZAKI","MIYAZAKI UNYU SHIKYOKU-CHO"]
["鹿児島","鹿児島","KAGOSHIMA","KAGOSHIMA UNYU SHIKYOKU-CHO"]
[null,"奄美","AMAMI","KAGOSHIMA UNYU SHIKYOKU-CHO"]
["沖縄","沖縄","OKINAWA","OKINAWA SOUGOU JIMU KYOKU-CHO"]

{"sheet":"Master_ProductCode","index":5,"n_rows":1002,"n_cols":4,"rows_kept":1002,"cut":false,"hidden":false,"merged":[[1,1,2,1],[1,2,1,3]]}
[]
[null,"Code","Name (Car / Products)"]
[null,null,"English","Japanese"]
[null,"001","AICHI","アイチ"]
[null,"002","ASAHI","旭"]
[null,"003","ANTICO","アンチコ"]
[null,"004","ARROW","アロ－"]
[null,"005","N/A"]
[null,"006","N/A"]
[null,"007","N/A"]
[null,"008","N/A"]
[null,"009","N/A"]
[null,"010","N/A"]
[null,"011","ISHIKAWAJIMACALLING","石川島コ－リング"]
[null,"012","ISUZU","いすゞ"]
[null,"013","ISUZUFULLHALF","いすゞフルハ－フ"]
[null,"014","ISEKI","ヰセキ"]
[null,"015","ICHIHARA","イチハラ"]
[null,"016","IWATEFUJI","岩手富士"]
[null,"017","ISHIKAWAJIMAKENKI","石川島建機"]
[null,"018","IWAFUJI","イワフジ"]
[null,"019","N/A"]
[null,"020","N/A"]
[null,"021","N/A"]
[null,"022","N/A"]
[null,"023","N/A"]
[null,"024","N/A"]
[null,"025","N/A"]
[null,"026","N/A"]
[null,"027","N/A"]
[null,"028","N/A"]
[null,"029","N/A"]
[null,"030","N/A"]
[null,"031","ESUKO","エスコ"]
[null,"032","NST","ＮＳＴ"]
[null,"033","NTK","ＮＴＫ"]
[null,"034","HK","エッチケ－"]
[null,"035","SN","ＳＮ"]
[null,"036","N/A"]
[null,"037","N/A"]
[null,"038","N/A"]
[null,"039","N/A"]
[null,"040","N/A"]
[null,"041","OAC","オ－エ－シ－"]
[null,"042","OHTA","オオタ"]
[null,"043","OHTUKABARMIYA","大塚バ－ミヤ"]
[null,"044","OHARA","大原"]
[null,"045","OHARATEKKO","大原鉄工"]
[null,"046","ORIENT","オリエント"]
[null,"047","N/A"]
[null,"048","N/A"]
[null,"049","N/A"]
[null,"050","N/A"]
[null,"051","KATO","カトウ"]
[null,"052","KAWASAKI","カワサキ"]
[null,"053","KAWANISHI","川西"]
[null,"054","KAWASAKI","川崎"]
[null,"055","KANTO","カントウ"]
[null,"056","N/A"]
[null,"057","N/A"]
[null,"058","N/A"]
[null,"059","N/A"]
[null,"060","N/A"]
[null,"061","CALLABELAIR","キャラベルエア"]
[null,"062","KYUSHUANZEN","キュウシュウアンゼン"]
[null,"063","KYOEI","共栄"]
[null,"064","KYOSAN","協三"]
[null,"065","KYORITSU","共立"]
[null,"066","KINSAN","金三"]
[null,"067","GINREI","ギンレイ"]
[null,"068","CATERPILLAR","キャタピラ－"]
[null,"069","CABTON","キャブトン"]
[null,"070","KYOKUTO","極東"]
[null,"071","KUBOTA","クボタ"]
[null,"072","KUBOTAFIAT","クボタフィアット"]
[null,"073","KUREHA","クレハ"]
[null,"074","KUROGANE","くろがね"]
[null,"075","N/A"]
[null,"076","N/A"]
[null,"077","N/A"]
[null,"078","N/A"]
[null,"079","N/A"]
[null,"080","N/A"]
[null,"081","N/A"]
[null,"082","N/A"]
[null,"083","N/A"]
[null,"084","N/A"]
[null,"085","N/A"]
[null,"086","N/A"]
[null,"087","N/A"]
[null,"088","N/A"]
[null,"089","N/A"]
[null,"090","N/A"]
[null,"091","KOBEITETSU","コ－ベイテツ"]
[null,"092","KOGA","コガ"]
[null,"093","KOJIMA","コジマ"]
[null,"094","KODAIRA","コダイラ"]
[null,"095","KONISHI","コニシ"]
[null,"096","KOMATSU","小松"]
[null,"097","KOMATSUINTER","小松インタ－"]
[null,"098","KOMATSUINTERNATIONAL","小松ｲﾝﾀ-ﾅｼｮﾅﾙ"]
[null,"099","KOMATSUHALF","小松ハフ"]
[null,"100","KOMATSUBLOWNOCKS","小松ブロ－ノックス"]
[null,"101","SAKAI","サカイ"]
[null,"102","SATOH","サト－"]
[null,"103","SASAKI","ササキ"]
[null,"104","N/A"]
[null,"105","N/A"]
[null,"106","N/A"]
[null,"107","N/A"]
[null,"108","N/A"]
[null,"109","N/A"]
[null,"110","N/A"]
[null,"111","JEEP","ジ－プ"]
[null,"112","SHIBAURA","シバウラ"]
[null,"113","GIANT","ジャイアント"]
[null,"114","JUPITER","ジュピタ－"]
[null,"115","JUPITERJUNIOR","ジュピタ－ジュニア"]
[null,"116","SHOSHIN","昭信"]
[null,"117","SHOWA","昭和"]
[null,"118","SHINKO","神鋼"]
[null,"119","SHINKO P&H","神鋼Ｐ＆Ｈ"]
[null,"120","SHINKOFIATARIS","神鋼ﾌｨｱｯﾄｱﾘｽ"]
[null,"121","SHINKOARISCHARMAERS","神鋼ｱﾘｽﾁｬ-ﾏ-ｽﾞ"]
[null,"122","SHINJIKO","シンジコウ"]
[null,"123","SHINMEIWA","シンメイワ"]
[null,"124","CHEVROLET","シボレ－"]
[null,"125","N/A"]
[null,"126","N/A"]
[null,"127","N/A"]
[null,"128","N/A"]
[null,"129","N/A"]
[null,"130","N/A"]
[null,"131","SUZUKI","スズキ"]
[null,"132","STAR","スタ－"]
[null,"133","SUBARU","スバル"]
[null,"134","SUMITOMO","住友"]
[null,"135","SUMITOMOYALE","住友エ－ル"]
[null,"136","SUMITOMOHANOMARG","住友ハノマ－グ"]
[null,"137","N/A"]
[null,"138","N/A"]
[null,"139","N/A"]
[null,"140","N/A"]
[null,"141","N/A"]
[null,"142","N/A"]
[null,"143","N/A"]
[null,"144","N/A"]
[null,"145","N/A"]
[null,"146","N/A"]
[null,"147","N/A"]
[null,"148","N/A"]
[null,"149","N/A"]
[null,"150","N/A"]
[null,"151","DAIHATSU","ダイハツ"]
[null,"152","TAKAKITA","タカキタ"]
[null,"153","TADANO","タダノ"]
[null,"154","DATSUN","ダットサン"]
[null,"155","N/A"]
[null,"156","N/A"]
[null,"157","N/A"]
[null,"158","N/A"]
[null,"159","N/A"]
[null,"160","N/A"]
[null,"161","N/A"]
[null,"162","N/A"]
[null,"163","N/A"]
[null,"164","N/A"]
[null,"165","N/A"]
[null,"166","N/A"]
[null,"167","N/A"]
[null,"168","N/A"]
[null,"169","N/A"]
[null,"170","N/A"]
[null,"171","N/A"]
[null,"172","N/A"]
[null,"173","N/A"]
[null,"174","N/A"]
[null,"175","N/A"]
[null,"176","N/A"]
[null,"177","N/A"]
[null,"178","N/A"]
[null,"179","N/A"]
[null,"180","N/A"]
[null,"181","TCM","ＴＣＭ"]
[null,"182","DERIKA","デリカ"]
[null,"183","N/A"]
[null,"184","N/A"]
[null,"185","N/A"]
[null,"186","N/A"]
[null,"187","N/A"]
[null,"188","N/A"]
[null,"189","N/A"]
[null,"190","N/A"]
[null,"191","TOKYU","東急"]
[null,"192","TOHAI","トウハイ"]
[null,"193","TOYO","ト－ヨ－"]
[null,"194","TOYOTA","トヨタ"]
[null,"195","TOYOPET","トヨペット"]
[null,"196","DREAMSUPERSPORTS","ﾄﾞﾘ-ﾑｽ-ﾊﾟ-ｽﾎﾟ-ﾂ"]
[null,"197","TRAILMOBILE","ﾄﾚ-ﾙﾓ-ﾋﾞﾙ"]
[null,"198","TOYODA-BARBER-GREENE","ﾄﾖﾀﾞﾊﾞ-ﾊﾞ-ｸﾞﾘ-ﾝ"]
[null,"199","TREX","トレクス"]
[null,"200","N/A"]
[null,"201","NAKANIHON","ナカニホン"]
[null,"202","N/A"]
[null,"203","N/A"]
[null,"204","N/A"]
[null,"205","N/A"]
[null,"206","N/A"]
[null,"207","N/A"]
[null,"208","N/A"]
[null,"209","N/A"]
[null,"210","N/A"]
[null,"211","NIIGATA","ニイガタ"]
[null,"212","NIKKO O&K","日鋼Ｏ＆Ｋ"]
[null,"213","NISSAN","ニッサン"]
[null,"214","NISSANJUNIOR","ニッサンジュニア"]
[null,"215","NISSANDIESEL","ニッサンディ－ゼル"]
[null,"216","NISSHA","日車"]
[null,"217","NISSHASHOCALL","日車シオコ－ル"]
[null,"218","NISSEKI","ニッセキ"]
[null,"219","NITTSU","日通"]
[null,"220","NIKKAI","日開"]
[null,"221","NICHIU","ニチユ"]
[null,"222","NIHONFORD","ニホンフォ－ド"]
[null,"223","N/A"]
[null,"224","N/A"]
[null,"225","N/A"]
[null,"226","N/A"]
[null,"227","N/A"]
[null,"228","N/A"]
[null,"229","N/A"]
[null,"230","N/A"]
[null,"231","N/A"]
[null,"232","N/A"]
[null,"233","N/A"]
[null,"234","N/A"]
[null,"235","N/A"]
[null,"236","N/A"]
[null,"237","N/A"]
[null,"238","N/A"]
[null,"239","N/A"]
[null,"240","N/A"]
[null,"241","N/A"]
[null,"242","N/A"]
[null,"243","N/A"]
[null,"244","N/A"]
[null,"245","N/A"]
[null,"246","N/A"]
[null,"247","N/A"]
[null,"248","N/A"]
[null,"249","N/A"]
[null,"250","N/A"]
[null,"251","PUBLICA","パブリカ"]
[null,"252","HAMANA","ハマナ"]
[null,"253","HAYASAKI","早崎"]
[null,"254","HANTA","ハンタ"]
[null,"255","N/A"]
[null,"256","N/A"]
[null,"257","N/A"]
[null,"258","N/A"]
[null,"259","N/A"]
[null,"260","N/A"]
[null,"261","HITACHI","日立"]
[null,"262","HINO","日野"]
[null,"263","HINOSHATAI","日野車体"]
[null,"264","HINORENAULT","日野ルノ－"]
[null,"265","HILLMANMINX","ヒルマンミンクス"]
[null,"266","HINOMOTO","日の本"]
[null,"267","N/A"]
[null,"268","N/A"]
[null,"269","N/A"]
[null,"270","N/A"]
[null,"271","FUJI","富士"]
[null,"272","FUSO","ふそう"]
[null,"273","FRANCEBED","フランスベッド"]
[null,"274","PRINCE","プリンス"]
[null,"275","FURUKAWA","古河"]
[null,"276","FULLHALF","フルハ－フ"]
[null,"277","VOLKSWAGEN","フォルクスワ－ゲン"]
[null,"278","N/A"]
[null,"279","N/A"]
[null,"280","N/A"]
[null,"281","BESSHO","ベッショ"]
[null,"282","N/A"]
[null,"283","N/A"]
[null,"284","N/A"]
[null,"285","N/A"]
[null,"286","N/A"]
[null,"287","N/A"]
[null,"288","N/A"]
[null,"289","N/A"]
[null,"290","N/A"]
[null,"291","HOWA","豊和"]
[null,"292","HOKUSATSU","ホクサツ"]
[null,"293","HOKUNOU","ホクノウ"]
[null,"294","HOSHIZAKI","ホシザキ"]
[null,"295","HODOGAYA","ホドガヤ"]
[null,"296","HONDA","ホンダ"]
[null,"297","HONDADREAM","ホンダドリ－ム"]
[null,"298","HOTTA","ホッタ"]
[null,"299","N/A"]
[null,"300","N/A"]
[null,"301","MAZDA","マツダ"]
[null,"302","MARUYAMA","丸山"]
[null,"303","N/A"]
[null,"304","N/A"]
[null,"305","N/A"]
[null,"306","N/A"]
[null,"307","N/A"]
[null,"308","N/A"]
[null,"309","N/A"]
[null,"310","N/A"]
[null,"311","MIZUSHIMA","ミズシマ"]
[null,"312","MITSUI","三井"]
[null,"313","MITSUBISHI","三菱"]
[null,"314","MITSUBISHIYUNBO","三菱ユンボ"]
[null,"315","MINSEI","ミンセイ"]
[null,"316","MITSUIMIIKE","三井三池"]
[null,"317","MITUOKA","ミツオカ"]
[null,"318","MITSUBISHI","三菱"]
[null,"319","N/A"]
[null,"320","N/A"]
[null,"321","N/A"]
[null,"322","N/A"]
[null,"323","N/A"]
[null,"324","N/A"]
[null,"325","N/A"]
[null,"326","N/A"]
[null,"327","N/A"]
[null,"328","N/A"]
[null,"329","N/A"]
[null,"330","N/A"]
[null,"331","MEIWA","メイワ"]
[null,"332","MEGURO","メグロ"]
[null,"333","N/A"]
[null,"334","N/A"]
[null,"335","N/A"]
[null,"336","N/A"]
[null,"337","N/A"]
[null,"338","N/A"]
[null,"339","N/A"]
[null,"340","N/A"]
[null,"341","MOTOE","モトユ"]
[null,"342","N/A"]
[null,"343","N/A"]
[null,"344","N/A"]
[null,"345","N/A"]
[null,"346","N/A"]
[null,"347","N/A"]
[null,"348","N/A"]
[null,"349","N/A"]
[null,"350","N/A"]
[null,"351","YAMAHA","ヤマハ"]
[null,"352","YANMAR","ヤンマ－"]
[null,"353","N/A"]
[null,"354","N/A"]
[null,"355","N/A"]
[null,"356","N/A"]
[null,"357","N/A"]
[null,"358","N/A"]
[null,"359","N/A"]
[null,"360","N/A"]
[null,"361","USOKI","ユソ－キ"]
[null,"362","YUTANI","油谷"]
[null,"363","YUTANIPOKUREN","油谷ポクレン"]
[null,"364","UNICC","ユニック"]
[null,"365","EUNOS","ユ－ノス"]
[null,"366","N/A"]
[null,"367","N/A"]
[null,"368","N/A"]
[null,"369","N/A"]
[null,"370","N/A"]
[null,"371","N/A"]
[null,"372","N/A"]
[null,"373","N/A"]
[null,"374","N/A"]
[null,"375","N/A"]
[null,"376","N/A"]
[null,"377","N/A"]
[null,"378","N/A"]
[null,"379","N/A"]
[null,"380","N/A"]
[null,"381","LILAC","ライラック"]
[null,"382","RABBIT","ラビット"]
[null,"383","N/A"]
[null,"384","N/A"]
[null,"385","N/A"]
[null,"386","N/A"]
[null,"387","N/A"]
[null,"388","N/A"]
[null,"389","N/A"]
[null,"390","N/A"]
[null,"391","RIKUO","陸王"]
[null,"392","N/A"]
[null,"393","N/A"]
[null,"394","N/A"]
[null,"395","N/A"]
[null,"396","N/A"]
[null,"397","N/A"]
[null,"398","N/A"]
[null,"399","N/A"]
[null,"400","N/A"]
[null,"401","N/A"]
[null,"402","N/A"]
[null,"403","N/A"]
[null,"404","N/A"]
[null,"405","N/A"]
[null,"406","N/A"]
[null,"407","N/A"]
[null,"408","N/A"]
[null,"409","N/A"]
[null,"410","N/A"]
[null,"411","LEXUS","レクサス"]
[null,"412","N/A"]
[null,"413","N/A"]
[null,"414","N/A"]
[null,"415","N/A"]
[null,"416","N/A"]
[null,"417","N/A"]
[null,"418","N/A"]
[null,"419","N/A"]
[null,"420","N/A"]
[null,"421","ROVER","ロ－バ－"]
[null,"422","N/A"]
[null,"423","N/A"]
[null,"424","N/A"]
[null,"425","N/A"]
[null,"426","N/A"]
[null,"427","N/A"]
[null,"428","N/A"]
[null,"429","N/A"]
[null,"430","N/A"]
[null,"431","WATANABE","ワタナベ"]
[null,"432","N/A"]
[null,"433","N/A"]
[null,"434","N/A"]
[null,"435","N/A"]
[null,"436","N/A"]
[null,"437","N/A"]
[null,"438","N/A"]
[null,"439","N/A"]
[null,"440","N/A"]
[null,"441","KOMATSU MEC","小松メック"]
[null,"442","COSMO","コスモ"]
[null,"443","KOMATSU","コマツ"]
[null,"444","KOBERUKO","コベルコ"]
[null,"445","N/A"]
[null,"446","N/A"]
[null,"447","N/A"]
[null,"448","N/A"]
[null,"449","N/A"]
[null,"450","N/A"]
[null,"451","N/A"]
[null,"452","N/A"]
[null,"453","N/A"]
[null,"454","N/A"]
[null,"455","N/A"]
[null,"456","N/A"]
[null,"457","N/A"]
[null,"458","N/A"]
[null,"459","N/A"]
[null,"460","N/A"]
[null,"461","N/A"]
[null,"462","N/A"]
[null,"463","N/A"]
[null,"464","N/A"]
[null,"465","N/A"]
[null,"466","N/A"]
[null,"467","N/A"]
[null,"468","N/A"]
[null,"469","N/A"]
[null,"470","N/A"]
[null,"471","N/A"]
[null,"472","N/A"]
[null,"473","N/A"]
[null,"474","N/A"]
[null,"475","N/A"]
[null,"476","N/A"]
[null,"477","N/A"]
[null,"478","N/A"]
[null,"479","N/A"]
[null,"480","N/A"]
[null,"481","N/A"]
[null,"482","N/A"]
[null,"483","N/A"]
[null,"484","N/A"]
[null,"485","N/A"]
[null,"486","N/A"]
[null,"487","N/A"]
[null,"488","N/A"]
[null,"489","N/A"]
[null,"490","N/A"]
[null,"491","N/A"]
[null,"492","N/A"]
[null,"493","N/A"]
[null,"494","N/A"]
[null,"495","N/A"]
[null,"496","N/A"]
[null,"497","N/A"]
[null,"498","N/A"]
[null,"499","N/A"]
[null,"500","N/A"]
[null,"501","AUDI","アウディ"]
[null,"502","AUTUNION","アウトウニオン"]
[null,"503","ACADIAN","アカディアン"]
[null,"504","ASTONMARTIN","アストンマ－ティン"]
[null,"505","ABARTH","アバルト"]
[null,"506","ALRAROMEO","アルファロメオ"]
[null,"507","ALPEINE","アルピ－ヌ"]
[null,"508","ANGLIA","アングリア"]
[null,"509","AMBASSADOR","アンバサダ－"]
[null,"510","AUTOBIANCHI","アウトビアンキ"]
[null,"511","INTERNATIONAL","インタ－ナショナル"]
[null,"512","INMPERIAL","インペリアル"]
[null,"513","INNOCENTI MINI","イノセンティミニ"]
[null,"514","INNOCHENTI","イノチェンティ"]
[null,"515","ISEKI","ヰセキ"]
[null,"516","ISUZU","いすゞ"]
[null,"517","N/A"]
[null,"518","N/A"]
[null,"519","N/A"]
[null,"520","N/A"]
[null,"521","WILLIS","ウイレス"]
[null,"522","WOLSELEY","ウズレ－"]
[null,"523","UNIMOG","ウニモグ"]
[null,"524","N/A"]
[null,"525","N/A"]
[null,"526","N/A"]
[null,"527","N/A"]
[null,"528","N/A"]
[null,"529","N/A"]
[null,"530","N/A"]
[null,"531","ASA","ＡＳＡ"]
[null,"532","ESCORT","エスコ－ト"]
[null,"533","NSU","ＮＳＵ"]
[null,"534","NW","ＮＷ"]
[null,"535","MG","ＭＧ"]
[null,"536","MB TRUCK","ＭＢトラック"]
[null,"537","MV AGUSTA","ＭＶアクスタ－"]
[null,"538","ELGIN","エルジン"]
[null,"539","LTD","エルティディ－"]
[null,"540","AMC","ＡＭＣ"]
[null,"541","AUSTIN","オ－スチン"]
[null,"542","AUSTINHEALEY","オ－スチンヒ－レ－"]
[null,"543","OLDSMOBILE","オ－ルズモビル"]
[null,"544","OPEL","オペル"]
[null,"545","AUSTRALIA MITSUBISHI","ｵ-ｽﾄﾗﾘｱ三菱"]
[null,"546","AUTECH ZAGATO","オ－テックザガ－ト"]
[null,"547","N/A"]
[null,"548","N/A"]
[null,"549","N/A"]
[null,"550","N/A"]
[null,"551","KEIZAR","カイザ－"]
[null,"552","CAPRI","カプリ"]
[null,"553","KARMANNGHIA","カルマンギァ"]
[null,"554","CAGIVA","カジバ"]
[null,"555","CARBODIES","カ－ボディ－ズ"]
[null,"556","N/A"]
[null,"557","N/A"]
[null,"558","N/A"]
[null,"559","N/A"]
[null,"560","N/A"]
[null,"561","CADILLAC","キャデラック"]
[null,"562","GALAXCE","ギャラクシ－"]
[null,"563","KIA","キア"]
[null,"564","N/A"]
[null,"565","N/A"]
[null,"566","N/A"]
[null,"567","N/A"]
[null,"568","N/A"]
[null,"569","N/A"]
[null,"570","N/A"]
[null,"571","CHRYSLER","クライスラ－"]
[null,"572","GRUS","グラ－ス"]
[null,"573","GREMLIN","グレムリン"]
[null,"574","KRAUSER","クラウザ－"]
[null,"575","N/A"]
[null,"576","N/A"]
[null,"577","N/A"]
[null,"578","N/A"]
[null,"579","N/A"]
[null,"580","N/A"]
[null,"581","CASE","ケ－ス"]
[null,"582","KL","ＫＬ"]
[null,"583","CASE INTERNATIONAL","ｹ-ｽ･ｲﾝﾀ-ﾅｼｮﾅﾙ"]
[null,"584","CATERHAM","ケ－タ－ハム"]
[null,"585","KASSBOHRER","ケスボ－ラ－"]
[null,"586","KTM","ＫＴＭ"]
[null,"587","N/A"]
[null,"588","N/A"]
[null,"589","N/A"]
[null,"590","N/A"]
[null,"591","COMET","コメット"]
[null,"592","GOLIATH","ゴリアット"]
[null,"593","CORTINA","コルチナ"]
[null,"594","CONSUL","コンサル"]
[null,"595","N/A"]
[null,"596","N/A"]
[null,"597","N/A"]
[null,"598","N/A"]
[null,"599","N/A"]
[null,"600","N/A"]
[null,"601","SAAB","サ－ブ"]
[null,"602","THUNDERBIRD","サンダ－バ－ド"]
[null,"603","SUMBEAM","サンビ－ム"]
[null,"604","SSANGYONG","サンヨン"]
[null,"605","SATURN","サタ－ン"]
[null,"606","N/A"]
[null,"607","N/A"]
[null,"608","N/A"]
[null,"609","N/A"]
[null,"610","N/A"]
[null,"611","JCB","ＪＣＢ"]
[null,"612","ZEPHYR","ジェファ－"]
[null,"613","JENSEN","ジェンセン"]
[null,"614","CITROEN","シトロエン"]
[null,"615","CHEVROLET","シボレ－"]
[null,"616","CHEVROLET CAMARO","シボレ－カマロ"]
[null,"617","CHEVROLET CORVAIR","シボレ－コルベア"]
[null,"618","CHEVROLET CORVETTE","シボレ－コルベット"]
[null,"619","CHEVROLET CHEVEE","シボレ－シェ－ビ－"]
[null,"620","CHEVROLET CHEVEENOVA","シボレ－シェビノ－バ－"]
[null,"621","CHEVROLET CHEVELLE","シボレ－シェベル"]
[null,"622","SIMCA","シムカ"]
[null,"623","SIMEZA","シメ－ザ"]
[null,"624","JAGUAR","ジャガ－"]
[null,"625","JAVELIN","ジャベリン"]
[null,"626","JOHNDEERE","ジョンディア"]
[null,"627","SINGER","シンガ－"]
[null,"628","GMC","ＧＭＣ"]
[null,"629","GMDAT","ＧＭダット"]
[null,"630","N/A"]
[null,"631","STUDEBAKER","スチュ－ドベ－カ－"]
[null,"632","SNOWTRAC","スノ－トラック"]
[null,"633","SUPERSEVEN","ス－パ－セブン"]
[null,"634","SBARRO","スバッロ"]
[null,"635","SUBARU","スバル"]
[null,"636","SMART","スマ－ト"]
[null,"637","N/A"]
[null,"638","N/A"]
[null,"639","N/A"]
[null,"640","N/A"]
[null,"641","ZETOR","ゼトア"]
[null,"642","N/A"]
[null,"643","N/A"]
[null,"644","N/A"]
[null,"645","N/A"]
[null,"646","N/A"]
[null,"647","N/A"]
[null,"648","N/A"]
[null,"649","N/A"]
[null,"650","N/A"]
[null,"651","ZODIAC","ゾデイアック"]
[null,"652","N/A"]
[null,"653","N/A"]
[null,"654","N/A"]
[null,"655","N/A"]
[null,"656","N/A"]
[null,"657","N/A"]
[null,"658","N/A"]
[null,"659","N/A"]
[null,"660","N/A"]
[null,"661","DAIMLER","ダイムラ－"]
[null,"662","TAUNUS","タウナス"]
[null,"663","DODGE","ダッジ"]
[null,"664","DODGE DART","ダッジダ－ト"]
[null,"665","TALBOT","タルボ"]
[null,"666","DYNAPAC","ダイナパック"]
[null,"667","DIAMOND STAR","ダイヤモンドスタ－"]
[null,"668","TMUK","ＴＭＵＫ"]
[null,"669","N/A"]
[null,"670","N/A"]
[null,"671","CHECKER","チェッカ－"]
[null,"672","N/A"]
[null,"673","N/A"]
[null,"674","N/A"]
[null,"675","N/A"]
[null,"676","N/A"]
[null,"677","N/A"]
[null,"678","N/A"]
[null,"679","N/A"]
[null,"680","N/A"]
[null,"681","HONDA OF AMERICA","ホンダオブアメリカ"]
[null,"682","HONDA","ホンダ"]
[null,"683","N/A"]
[null,"684","N/A"]
[null,"685","N/A"]
[null,"686","N/A"]
[null,"687","N/A"]
[null,"688","N/A"]
[null,"689","N/A"]
[null,"690","N/A"]
[null,"691","DKW","ＤＫＷ"]
[null,"692","DETOMASO","デトマソ"]
[null,"693","DAVIDBROWN","デビットブラウン"]
[null,"694","DELICA","デリカ"]
[null,"695","DESOTO","デソ－ト"]
[null,"696","TVR","ＴＶＲ"]
[null,"697","DAEWOO","デ－ウ"]
[null,"698","N/A"]
[null,"699","N/A"]
[null,"700","N/A"]
[null,"701","DEUTZ","ドイツ"]
[null,"702","TRIUMPH","トライアンフ"]
[null,"703","TRANSAM","トランザム"]
[null,"704","DUCATI","ドカテイ"]
[null,"705","DNEPR","ドニエプル"]
[null,"706","DROG MOLLER","ドレクメ－ラ－"]
[null,"707","DONKERVOORT","ドンカ－ブ－ト"]
[null,"708","TOYOTA TMM","トヨタ　ＴＭＭ"]
[null,"709","TOYOTA","トヨタ"]
[null,"710","TOYOTA TMMK","トヨタ　ＴＭＭＫ"]
[null,"711","NAFIELD","ナフィ－ルド"]
[null,"712","N/A"]
[null,"713","N/A"]
[null,"714","N/A"]
[null,"715","N/A"]
[null,"716","N/A"]
[null,"717","N/A"]
[null,"718","N/A"]
[null,"719","N/A"]
[null,"720","N/A"]
[null,"721","NISSAN","ニッサン"]
[null,"722","NISSAN","ニッサン"]
[null,"723","NISSAN NM","ニッサン　ＮＭ"]
[null,"724","NISSAN MI","ニッサン　ＭＩ"]
[null,"725","NISSAN UK","ニッサン　ＵＫ"]
[null,"726","N/A"]
[null,"727","N/A"]
[null,"728","N/A"]
[null,"729","N/A"]
[null,"730","N/A"]
[null,"731","NUMMI","ＮＵＭＭＩ"]
[null,"732","N/A"]
[null,"733","N/A"]
[null,"734","N/A"]
[null,"735","N/A"]
[null,"736","N/A"]
[null,"737","N/A"]
[null,"738","N/A"]
[null,"739","N/A"]
[null,"740","N/A"]
[null,"741","NECKER","ネッカ－"]
[null,"742","NEOPLAN","ネオプラン"]
[null,"743","NAYLOR","ネイラ－"]
[null,"744","N/A"]
[null,"745","N/A"]
[null,"746","N/A"]
[null,"747","N/A"]
[null,"748","N/A"]
[null,"749","N/A"]
[null,"750","N/A"]
[null,"751","NORTON","ノ－トン"]
[null,"752","N/A"]
[null,"753","N/A"]
[null,"754","N/A"]
[null,"755","N/A"]
[null,"756","N/A"]
[null,"757","N/A"]
[null,"758","N/A"]
[null,"759","N/A"]
[null,"760","N/A"]
[null,"761","HARLEY-DAVIDSON","ハ－レ－ダビットソン"]
[null,"762","BAUZ","バウツ"]
[null,"763","PANHARD","バナ－ル"]
[null,"764","VALIANT","バリアント"]
[null,"765","PANTHER","パンサ－"]
[null,"766","VANDENPLAS","パンデンプラ"]
[null,"767","HUMBER","ハンバ－"]
[null,"768","VANHOOL","バンホ－ル"]
[null,"769","N/A"]
[null,"770","N/A"]
[null,"771","BMW","ＢＭＷ"]
[null,"772","BUICK","ビュイック"]
[null,"773","HILLMAN","ヒルマン"]
[null,"774","HILLMANIMP","ヒルマンインプ"]
[null,"775","PININFARINA","ピニンファリナ"]
[null,"776","BMW ALPINA","ＢＭＷアルピナ"]
[null,"777","BSA","ＢＳＡ"]
[null,"778","BIMOTA","ピモ－タ－"]
[null,"779","PUMA","ピュ－マ"]
[null,"780","BUELL","ビュ－エル"]
[null,"781","FIAT","フィアット"]
[null,"782","VWPORSCHE","ＶＭポルシェ"]
[null,"783","FAIRMONT","フェアモント"]
[null,"784","FAIRLANE","フェアレ－ン"]
[null,"785","FERRARI","フェラ－リ"]
[null,"786","FORD","フォ－ド"]
[null,"787","FORD THUNDERBIRD","フォ－ドｻﾝﾀﾞ-ﾊﾞ-ﾄﾞ"]
[null,"788","FORDSON","フォ－ドソン"]
[null,"789","FORDFALCON","フォ－ドﾌｧﾙｺﾝ"]
[null,"790","FORDMUSTANG","フォ－ドﾑｽﾀﾝｸﾞ"]
[null,"791","VOLKSWAGEN","フォルクスワ－ゲン"]
[null,"792","BUGATTI","ブガッティ"]
[null,"793","PEUGEOT","プジョ－"]
[null,"794","PREQUEFT","プリクエフト"]
[null,"795","PRENOTE","プリノ－ト"]
[null,"796","PLYMOUTH","プリムス"]
[null,"797","PRINCESS","プリンセス"]
[null,"798","PHOENIX","フェニックス"]
[null,"799","N/A"]
[null,"800","N/A"]
[null,"801","PAYRODA","ペイロ－ダ－"]
[null,"802","PACER","ペ－サ－"]
[null,"803","BENTLEY","ベントレ－"]
[null,"804","BERTONE","ベルト－ネ"]
[null,"805","N/A"]
[null,"806","N/A"]
[null,"807","N/A"]
[null,"808","N/A"]
[null,"809","N/A"]
[null,"810","N/A"]
[null,"811","HORNET","ホ－ネット"]
[null,"812","HOLDEN","ホ－ルデン"]
[null,"813","VAUXHALL","ボクスホ－ル"]
[null,"814","BORGWARD","ボルグワ－ド"]
[null,"815","PORSCHE","ポルシェ"]
[null,"816","VOLVO","ボルボ"]
[null,"817","PONTIAC","ボンテアック"]
[null,"818","PONDEQUIPE","ポンドエクイップ"]
[null,"819","PONDEFI","ポンドエフイ"]
[null,"820","PONBADHIA","ポンバディア"]
[null,"821","MERCURY","マ－キュリ－"]
[null,"822","MAVERICK","マ－ベリック"]
[null,"823","MASERATI","マセラテイ"]
[null,"824","MATADOR","マタド－ル"]
[null,"825","MCCORMICK INTERNATIONAL","マッコ－ミックｲﾝﾀ-ﾅｼｮﾅﾙ"]
[null,"826","MASSEYFERGUSON","マッセイファ－ガソン"]
[null,"827","MAETRO","マエストロ"]
[null,"828","MAGNI","マ－ニ"]
[null,"829","MAN","マン"]
[null,"830","MAZDA NM","マツダ　ＮＭ"]
[null,"831","MINI","ミニ"]
[null,"832","MITSUBISHI","三菱"]
[null,"833","MITSUBISHI","三菱"]
[null,"834","MITSUBISHI","三菱"]
[null,"835","MITSUBISHI","三菱"]
[null,"836","N/A"]
[null,"837","N/A"]
[null,"838","N/A"]
[null,"839","N/A"]
[null,"840","N/A"]
[null,"841","MMUSTANG","ムスタング"]
[null,"842","N/A"]
[null,"843","N/A"]
[null,"844","N/A"]
[null,"845","N/A"]
[null,"846","N/A"]
[null,"847","N/A"]
[null,"848","N/A"]
[null,"849","N/A"]
[null,"850","N/A"]
[null,"851","MERCEDESBENZ","メルセデスベンツ"]
[null,"852","MELROE","メルロ"]
[null,"853","N/A"]
[null,"854","N/A"]
[null,"855","N/A"]
[null,"856","N/A"]
[null,"857","N/A"]
[null,"858","N/A"]
[null,"859","N/A"]
[null,"860","N/A"]
[null,"861","MORGAN","モ－ガン"]
[null,"862","MORRIS","モ－リス"]
[null,"863","MOSKVITCH","モスクビッチ"]
[null,"864","MOTOGUZZI","モトグッティ"]
[null,"865","MOKE","モ－ク"]
[null,"866","MONTEGO","モンテゴ"]
[null,"867","MOTO MORINI","モトモリ－ニ"]
[null,"868","MONTESA","モンテッサ"]
[null,"869","N/A"]
[null,"870","N/A"]
[null,"871","JAWA","ヤワ"]
[null,"872","N/A"]
[null,"873","N/A"]
[null,"874","N/A"]
[null,"875","N/A"]
[null,"876","N/A"]
[null,"877","N/A"]
[null,"878","N/A"]
[null,"879","N/A"]
[null,"880","N/A"]
[null,"881","UNIRODA","ユニロ－ダ"]
[null,"882","N/A"]
[null,"883","N/A"]
[null,"884","N/A"]
[null,"885","N/A"]
[null,"886","N/A"]
[null,"887","N/A"]
[null,"888","N/A"]
[null,"889","N/A"]
[null,"890","N/A"]
[null,"891","N/A"]
[null,"892","N/A"]
[null,"893","N/A"]
[null,"894","N/A"]
[null,"895","N/A"]
[null,"896","N/A"]
[null,"897","N/A"]
[null,"898","N/A"]
[null,"899","N/A"]
[null,"900","N/A"]
[null,"901","RILEY","ライレ－"]
[null,"902","LANCIA","ランチャ"]
[null,"903","LANDROVER","ランドロバ－"]
[null,"904","RAMBLER","ランブラ－"]
[null,"905","LAMBORGHINI","ランボルギ－ニ"]
[null,"906","LANZ","ランツ"]
[null,"907","LAVERDA","ラベルダ"]
[null,"908","LANCIA","ランチア"]
[null,"909","LADA","ラ－ダ"]
[null,"910","LAFER","ラッフェル"]
[null,"911","RELIANT","リライアント"]
[null,"912","LINCOLN","リンカ－ン"]
[null,"913","N/A"]
[null,"914","N/A"]
[null,"915","N/A"]
[null,"916","N/A"]
[null,"917","N/A"]
[null,"918","N/A"]
[null,"919","N/A"]
[null,"920","N/A"]
[null,"921","RENAULT","ルノ－"]
[null,"922","N/A"]
[null,"923","N/A"]
[null,"924","N/A"]
[null,"925","N/A"]
[null,"926","N/A"]
[null,"927","N/A"]
[null,"928","N/A"]
[null,"929","N/A"]
[null,"930","N/A"]
[null,"931","REBEL","レ－ベル"]
[null,"932","RANGE ROVER","レンジロ－バ－"]
[null,"933","N/A"]
[null,"934","N/A"]
[null,"935","N/A"]
[null,"936","N/A"]
[null,"937","N/A"]
[null,"938","N/A"]
[null,"939","N/A"]
[null,"940","N/A"]
[null,"941","LOTUS","ロ－タス"]
[null,"942","ROVER","ロ－バ－"]
[null,"943","ROLLSROYCE","ロ－ルスロイス"]
[null,"944","N/A"]
[null,"945","N/A"]
[null,"946","N/A"]
[null,"947","N/A"]
[null,"948","N/A"]
[null,"949","N/A"]
[null,"950","N/A"]
[null,"951","AMAZONAS","アマゾネス"]
[null,"952","DUCATI","ドゥカティ"]
[null,"953","HONDA CANADA","ホンダカナダ"]
[null,"954","HYUNDAI","ヒュンダイ"]
[null,"955","LAND ROVER","ランドロ－バ－"]
[null,"956","HONDA OF THE UK","ホンダオブザユ－ケ－"]
[null,"957","HONDA","ホンダ"]
[null,"958","MAYBACH","マイバッハ"]
[null,"959","N/A"]
[null,"960","N/A"]
[null,"961","ENFIELD","エンフィ－ルド"]
[null,"962","MCC","エムシ－シ－"]
[null,"963","MCC","ＭＣＣ"]
[null,"964","N/A"]
[null,"965","N/A"]
[null,"966","N/A"]
[null,"967","N/A"]
[null,"968","N/A"]
[null,"969","N/A"]
[null,"970","N/A"]
[null,"971","N/A"]
[null,"972","N/A"]
[null,"973","N/A"]
[null,"974","N/A"]
[null,"975","N/A"]
[null,"976","N/A"]
[null,"977","N/A"]
[null,"978","N/A"]
[null,"979","N/A"]
[null,"980","N/A"]
[null,"981","N/A"]
[null,"982","N/A"]
[null,"983","N/A"]
[null,"984","N/A"]
[null,"985","N/A"]
[null,"986","N/A"]
[null,"987","N/A"]
[null,"988","N/A"]
[null,"989","N/A"]
[null,"990","N/A"]
[null,"991","N/A"]
[null,"992","N/A"]
[null,"993","N/A"]
[null,"994","N/A"]
[null,"995","N/A"]
[null,"996","N/A"]
[null,"997","TEST","試作"]
[null,"998","HOMEMADE","組立"]
[null,"999","UNKNOWN","不明"]

{"sheet":"Master_Names","index":6,"n_rows":102,"n_cols":3,"rows_kept":102,"cut":false,"hidden":false,"merged":[]}
[]
[null,"No.","Name - Dammy"]
[null,"001","ARAI  TERUO"]
[null,"002","WAKABAYASHI  YOSHIFUMI"]
[null,"003","TAKEMASA  YOSHIYUKI"]
[null,"004","KOMADA  MANABU"]
[null,"005","ADACHI  TETSUYA"]
[null,"006","KANDA  SHOZO"]
[null,"007","SUZUKI  TOMOATSU"]
[null,"008","TANAKA  KIYOKATSU"]
[null,"009","YOSHIKAWA  AKIRA"]
[null,"010","NOMURA  MASASHI"]
[null,"011","IUCHI  EIJI"]
[null,"012","INOUE  KATSUMI"]
[null,"013","NISHIDA  YUJI"]
[null,"014","TOMONO  MUNEYUKI"]
[null,"015","TANABE  TOSHIKATSU"]
[null,"016","SAWADA  TAKESHI"]
[null,"017","NAKAMURA  TAKATOSHI"]
[null,"018","GOTO  MASAYUKI"]
[null,"019","TOIDA  AKIHIKO"]
[null,"020","FUJITA  KAZUHIKO"]
[null,"021","KOYAMA  SHOJI"]
[null,"022","FUJIMOTO  YOSHIFUSA"]
[null,"023","SAIKI  HIROYUKI"]
[null,"024","NEMOTO  TOYOKO"]
[null,"025","UCHIYAMA  MASAMI"]
[null,"026","UCHIYAMA  TAKAHARU"]
[null,"027","KAWAMURA  KAZUSHI"]
[null,"028","WATABE  KOICHI"]
[null,"029","HASHIMOTO ICHIRO"]
[null,"030","KAWAGUSHI  MASAKI"]
[null,"031","MINEGISHI  KENICHI"]
[null,"032","SUZUKI  MOTOSHI"]
[null,"033","YAMAGUCHI  NAOMI"]
[null,"034","YOSHIDA  MANABU"]
[null,"035","TOKUMOTO  MAKOTO"]
[null,"036","NOBUNAGA  NORIYUKI"]
[null,"037","OKAMOTO  JINSAKU"]
[null,"038","OTA  MASAHARU"]
[null,"039","SAKAMOTO  MANABU"]
[null,"040","HOZUMI  HIROAKI"]
[null,"041","MATSUDA  KUNIAKI"]
[null,"042","KITAGUCHI  TOSHITSUGU"]
[null,"043","ARIUCHI  YUKO"]
[null,"044","IKEDA  TSUTOMU"]
[null,"045","MORIMURA  KENJI"]
[null,"046","YAMAMOTO  HIROO"]
[null,"047","KOBAYASHI  TAKASHI"]
[null,"048","WADA  YUMIE"]
[null,"049","ARIMURA  HIROKO"]
[null,"050","KAGAWA  HIDEAKI"]
[null,"051","TAKIGAWA  YUSUKE"]
[null,"052","FUKUDA  JUNYA"]
[null,"053","WATANABE  SATOSHI"]
[null,"054","OKABE  YUKINORI"]
[null,"055","TERAUCHI  TORU"]
[null,"056","YOKOMIZO  KEIICHIRO"]
[null,"057","OZAWA  TOSHIRO"]
[null,"058","TANAHASHI  KOICHI\\"]
[null,"059","NANAO  JUNYA"]
[null,"060","HONDA  YUUKI"]
[null,"061","NAKAGAWA  SHOICHI"]
[null,"062","YOSHIKAWA  FUMIHIRO"]
[null,"063","ISHIDA  MASAO"]
[null,"064","CHIBA TETSURO"]
[null,"065","IIYAMA  KAZUE"]
[null,"066","ISHII  KOJI"]
[null,"067","MATSUO  SHINJI"]
[null,"068","NAKANISHI  TAKAO"]
[null,"069","TERAUCHI  KIYOKO"]
[null,"070","NISHIKIORI  SHUICHIRO"]
[null,"071","NAESHIRO HIDEJI"]
[null,"072","HIROSE TAKAKO"]
[null,"073","KAMISHIMA KEIGO"]
[null,"074","OGATA KEIKO"]
[null,"075","KIMISHIMA ICHIRO"]
[null,"076","KIDO TAKAMUNE"]
[null,"077","SUZUKI KYOUTARO"]
[null,"078","DAICHI KEIZOU"]
[null,"079","SHIMAMOTO KIMIO"]
[null,"080","MASUNAGA KENICHIRO"]
[null,"081","TOUDOH JUZOH"]
[null,"082","AKITA MIHO"]
[null,"083","TERAO AKIFUMI"]
[null,"084","KINEYA YUKO"]
[null,"085","KAWASHIMA YUJI"]
[null,"086","IHARA AKIHITO"]
[null,"087","YAMAMOTO HIROKAZU"]
[null,"088","SAITOH KEIKO"]
[null,"089","TANI CHUICHIRO"]
[null,"090","NAGAO TOSHIAKI"]
[null,"091","YOSHIKAWA NAOKI"]
[null,"092","HASEGAWA MASAHIKO"]
[null,"093","YAMAMOTO KATSUHIRO"]
[null,"094","ASANO TAKESHI"]
[null,"095","IMAMOTO YOUICHI"]
[null,"096","OOTANI MITSUSHIGE"]
[null,"097","SHIRAISHI YUKO"]
[null,"098","SUGANO AKIRA"]
[null,"099","SETO HIDEKATSU"]
[null,"100","FUJII AKEMI"]