{"text_format":"1","workbook":"xlsx","n_sheets":7,"sheets":["PrintPage","EntryForm","Selection&DATE_Entry","KANA-Palette","Master_Lists","Master_ProductCode","Master_Names"],"not_rendered":{"charts":0,"images":0,"macros":1,"external_links":2,"defined_names":26,"comments":2,"pivot_tables":0},"unopened":[],"bounds":{"document_bytes":16777216,"sheet_cells":100000,"rows_first":2000,"rows_last":500,"rows_between":2000,"halvings":0,"cell_chars":16384,"cell_head_chars":4096},"cells_cut":0,"cells_raw":0,"read":"whole","date_system":"1900"}

{"sheet":"PrintPage","index":0,"n_rows":26,"n_cols":26,"rows_kept":26,"cut":false,"hidden":false,"merged":[[25,12,25,23],[6,1,6,3],[7,1,7,3],[11,24,11,25],[11,20,11,23],[11,16,11,19],[9,1,9,3],[10,1,10,3],[11,1,11,3],[24,7,24,25],[23,7,23,11],[23,15,23,25],[15,8,15,10],[16,7,16,13],[14,10,14,12],[13,1,13,3],[5,12,5,19],[0,2,0,3],[0,4,0,25],[3,12,3,13],[3,6,3,8],[3,1,3,2],[1,16,2,25],[3,14,3,15],[1,1,2,5],[1,6,2,11],[1,12,2,15],[13,24,13,25],[13,16,13,17],[13,18,13,19],[11,5,11,7],[13,22,13,23],[13,10,13,13],[12,5,12,7],[14,6,14,9],[13,20,13,21],[16,4,16,5],[16,1,16,2],[15,4,15,5],[14,1,14,2],[15,1,15,3],[13,14,13,15],[13,6,13,9],[12,1,12,3],[4,1,4,11],[3,16,3,25],[5,9,5,10],[12,20,12,22],[12,16,12,18],[4,12,4,19],[4,20,4,25],[11,8,11,13],[12,8,12,13],[11,14,11,15],[8,1,8,3],[5,20,5,25],[5,1,5,7],[9,17,9,20],[7,17,7,20],[21,1,21,25],[22,1,22,25],[17,1,17,25],[18,1,18,25],[19,1,19,25],[20,1,20,25]]}
[null,"No.",{"$f":"EntryForm!C1:C1","v":"00959"},null,"                                                      EXPORT CERTIFICATE"]
[null,"License number",null,null,null,null,"Last reg. Date",null,null,null,null,null,"First reg. Month",null,null,null,"Frame number"]
[]
[null,{"$f":"EntryForm!B3","v":"KITAKYUSHU"},null,{"$f":"EntryForm!D3","v":399},{"$f":"EntryForm!F3","v":"TU"},{"$f":"EntryForm!G3","v":8270},{"$f":"EntryForm!H3","v":{"$error":"#N/A"}},null,null,{"$f":"EntryForm!K3","v":15},",",{"$f":"EntryForm!N3","v":2024},{"$f":"EntryForm!O3","v":"August,"},null,{"$f":"EntryForm!Q3","v":2010},null,{"$f":"EntryForm!S3","v":"WBAPH36070NM65102"}]
[null,"Name",null,null,null,null,null,null,null,null,null,null,"Model",null,null,null,null,null,null,null,"Engine model"]
[null,"TMT",null,null,null,null,null,null,"[",{"$f":"EntryForm!K5","v":"771"},null,"]",{"$f":"EntryForm!O5","v":"LBA-PH25"},null,null,null,null,null,null,null,{"$f":"EntryForm!W5","v":"N53B30A"}]
[null,"Last owner's name",null,null,{"$f":"EntryForm!F6","v":"IBC JAPAN KABUSHIKIGAISHA"}]
[null,"Above address ",null,null,{"$f":"EntryForm!F7","v":"KYOTO-FU KYOTO-SHI FUSHIMI-KU NAKAJIMA MIYANOMAE-CHO 64"}]
[null,"Last user's name",null,null,{"$f":"EntryForm!F8","v":"*******"}]
[null,"Above address",null,null,{"$f":"EntryForm!F9","v":"*******"}]
[null,"Above location",null,null,{"$f":"EntryForm!F10","v":"*******"}]
[null,"Category",null,null,"Purpose of use","Private or commercial",null,null,"Style of Vehicle",null,null,null,null,null,"Personal capacity",null,"Cargo capacity",null,null,null,"Net weight",null,null,null,"Gross weight"]
[null,{"$f":"EntryForm!B12","v":"MEDIUM"},null,null,{"$f":"EntryForm!F12","v":"Passenger"},{"$f":"EntryForm!G12","v":"PRIVATE"},null,null,{"$f":"EntryForm!J12","v":"SEDAN"},null,null,null,null,null,{"$f":"EntryForm!Q12","v":5},"people",{"$f":"EntryForm!S12","v":0},null,null,"kg",{"$f":"EntryForm!W12","v":1560},null,null,"kg",{"$f":"EntryForm!AA12","v":1835},"kg"]
[null,"Displacement or outputpower",null,null,"Fuel","Type No.","Code no.",null,null,null,"Length",null,null,null,"Width",null,"Height",null,"F.F wight",null,"F.R. weight",null,"R.F. weight",null,"R.R. weight"]
[null,{"$f":"EntryForm!B14","v":"2.99"},null,"kw                  L",{"$f":"EntryForm!F14","v":"PETROL"},{"$f":"EntryForm!G14","v":"16530"},{"$f":"EntryForm!H14","v":"0004"},null,null,null,{"$f":"EntryForm!L14","v":454},null,null,"cm",{"$f":"EntryForm!Q14","v":180},"cm",{"$f":"EntryForm!S14","v":142},"cm",{"$f":"EntryForm!U14","v":800},"kg",{"$f":"EntryForm!W14","v":0},"kg",{"$f":"EntryForm!Y14","v":0},"kg",{"$f":"EntryForm!AA14","v":760},"kg"]
[null,"EXPIRY DATE",null,null,{"$f":"EntryForm!F15","v":"October,"},null,{"$f":"EntryForm!H15","v":23},",",{"$f":"EntryForm!K15","v":2024}]
[null,"REMARK:",null,"[","KYOTO",null,"]"]
[]
[]
[]
[]
[]
[]
[null,null,null,null,null,null,null,{"$f":"EntryForm!I21","v":"April,"},null,null,null,null,{"$f":"EntryForm!O21","v":24},",",{"$f":"EntryForm!Q21","v":2024},"KYOTO UNYU SHIKYOKU-CHO"]
[null,null,null,null,null,null,null,"We IBC JAPAN LTD. verify that this English translation of                                                                                                 Certificate Registration is exactly the same with the original Japanese edition"]
[null,null,null,null,null,null,null,null,null,null,null,null,{"$f":"EntryForm!O24","v":0}]

{"sheet":"EntryForm","index":1,"n_rows":23,"n_cols":28,"rows_kept":23,"cut":false,"hidden":false,"merged":[[20,17,20,27],[20,8,20,13],[20,1,23,7],[21,8,21,27],[23,8,23,13],[23,24,23,27],[22,8,22,27],[23,14,23,23],[12,26,12,27],[13,7,13,10],[13,11,13,14],[12,24,12,25],[15,8,15,15],[14,7,14,8],[14,10,14,12],[14,1,14,4],[14,5,14,6],[15,1,15,2],[13,1,13,3],[11,18,11,20],[15,5,15,6],[11,22,11,24],[12,1,12,4],[12,7,12,10],[12,11,12,15],[12,16,12,17],[12,18,12,19],[12,20,12,21],[12,22,12,23],[11,1,11,4],[11,6,11,8],[11,9,11,15],[11,16,11,17],[10,16,10,17],[10,18,10,21],[10,22,10,25],[10,26,10,27],[5,1,5,4],[6,1,6,4],[6,22,6,26],[7,1,7,4],[8,22,8,26],[8,1,8,4],[9,1,9,4],[10,1,10,4],[10,6,10,8],[10,9,10,15],[4,1,4,8],[4,14,4,21],[4,22,4,27],[4,11,4,13],[3,1,3,13],[3,14,3,21],[3,22,3,27],[2,18,2,27],[0,2,0,4],[0,5,0,27],[1,1,1,6],[1,7,1,13],[1,14,1,17],[1,18,1,27],[2,1,2,2],[2,7,2,9],[2,14,2,15],[2,16,2,17],[2,3,2,4],[2,10,2,11]]}
[null,"No.","00959",null,null,"                                            EXPORT CERTIFICATE"]
[null,"License number",null,null,null,null,null,"Last reg. Date",null,null,null,null,null,null,"First reg. Month",null,null,null,"Frame number"]
[null,{"$f":"'Selection&DATE_Entry'!H3","v":"KITAKYUSHU"},null,399,null,"TU",8270,{"$f":"'Selection&DATE_Entry'!I15","v":{"$error":"#N/A"}},null,null,{"$f":"'Selection&DATE_Entry'!J15","v":15},null,",",{"$f":"'Selection&DATE_Entry'!H15","v":2024},{"$f":"'Selection&DATE_Entry'!I18","v":"August,"},null,{"$f":"'Selection&DATE_Entry'!H18","v":2010},null,"WBAPH36070NM65102"]
[null,"Name",null,null,null,null,null,null,null,null,null,null,null,null,"Model",null,null,null,null,null,null,null,"Engine model"]
[null,{"$f":"VLOOKUP(K5,Master_ProductCode!B4:C1002,2,FALSE)","v":"BMW"},null,null,null,null,null,null,null,"[","771","]",null,null,"LBA-PH25",null,null,null,null,null,null,null,"N53B30A"]
[null,"Last owner's name",null,null,null,"IBC JAPAN KABUSHIKIGAISHA"]
[null,"Above address ",null,null,null,"KYOTO-FU KYOTO-SHI FUSHIMI-KU NAKAJIMA MIYANOMAE-CHO 64",null,null,null,null,null,null,null,null,null,null,null,null,null,null,null,null,"Go To Address Seacher"]
[null,"Last user's name",null,null,null,"*******"]
[null,"Above address",null,null,null,"*******",null,null,null,null,null,null,null,null,null,null,null,null,null,null,null,null,"Go To Address Seacher"]
[null,"Above location",null,null,null,"*******"]
[null,"Category",null,null,null,"Purpose of use","Private or commercial",null,null,"Style of Vehicle",null,null,null,null,null,null,"Personal capacity",null,"Cargo capacity",null,null,null,"Net weight",null,null,null,"Gross weight"]
[null,{"$f":"'Selection&DATE_Entry'!H5","v":"MEDIUM"},null,null,null,{"$f":"'Selection&DATE_Entry'!L9","v":"Passenger"},{"$f":"'Selection&DATE_Entry'!H7","v":"PRIVATE"},null,null,{"$f":"'Selection&DATE_Entry'!H9","v":"SEDAN"},null,null,null,null,null,null,5,null,null,null,null,"kg",1560,null,null,null,1835,"kg"]
[null,"Displacement or outputpower",null,null,null,"Fuel","Type No.","Code no.",null,null,null,"Length",null,null,null,null,"Width",null,"Height",null,"F.F wight",null,"F.R. weight",null,"R.F. weight",null,"R.R. weight"]
[null,"2.99",null,null,"kw                  L",{"$f":"'Selection&DATE_Entry'!H11","v":"PETROL"},"16530","0004",null,null,null,454,null,null,null,"cm",180,"cm",142,"cm",800,"kg",null,"kg",null,"kg",{"$f":"W12-U14","v":760},"kg"]
[null,"EXPIRY DATE",null,null,null,{"$f":"'Selection&DATE_Entry'!I21","v":"October,"},null,{"$f":"'Selection&DATE_Entry'!J21","v":23},null,",",{"$f":"'Selection&DATE_Entry'!H21","v":2024}]
[null,"REMARK:",null,null,"[",null,null,"]"]
[]
[]
[]
[]
[null,null,null,null,null,null,null,null,{"$f":"'Selection&DATE_Entry'!I24","v":"April,"},null,null,null,null,null,{"$f":"'Selection&DATE_Entry'!J24","v":24},",",{"$f":"'Selection&DATE_Entry'!H24","v":2024}]
[null,null,null,null,null,null,null,null,"                    We IBC JAPAN LTD. verify that this English translation of                                                                                                 Certificate Registration is"]
[null,null,null,null,null,null,null,null," exactly the same with the original Japanese edition"]

{"sheet":"Selection&DATE_Entry","index":2,"n_rows":24,"n_cols":13,"rows_kept":24,"cut":false,"hidden":false,"merged":[[7,11,7,12],[8,11,8,12],[4,7,4,12],[5,6,5,12],[6,7,6,12],[7,6,7,10],[0,1,0,12],[15,10,17,10],[15,11,17,11],[15,12,17,12],[16,1,17,1],[12,1,12,5],[15,1,15,5],[1,1,1,5],[2,1,2,2],[1,11,1,12],[2,11,2,12],[1,6,1,10],[2,7,2,10],[2,3,2,5],[3,6,3,12],[8,7,8,10],[9,1,9,5],[10,1,10,2],[13,6,13,7],[16,6,16,7],[10,7,10,12],[11,1,11,9],[13,1,14,1],[9,6,9,12],[22,10,23,10],[22,11,23,11],[10,3,10,5],[16,2,17,2],[16,3,16,5],[12,6,12,9],[15,6,15,9],[13,2,14,2],[13,3,13,5],[20,10,20,12],[22,12,23,12],[22,6,22,7],[17,4,17,5],[12,10,13,12],[18,6,18,9],[21,6,21,9],[19,6,19,7],[16,8,16,9],[17,8,17,9],[14,10,14,12],[21,10,21,12],[4,3,4,5],[6,3,6,5],[8,3,8,5],[3,1,3,5],[4,1,4,2],[5,1,5,5],[6,1,6,2],[7,1,7,5],[8,1,8,2],[19,1,20,1],[18,1,18,5],[22,2,23,2],[22,3,22,5],[22,1,23,1],[21,1,21,5],[19,2,20,2],[19,3,19,5]]}
[null,"Selection Form"]
[null,"自動車登録番号",null,null,null,null,"License Number",null,null,null,null,"Issued / Authorized Name by;"]
[null,"Registered Place",null,"北九州",null,null,"→",{"$f":"VLOOKUP(D3,Master_Lists!B3:C119,2,FALSE)","v":"KITAKYUSHU"},null,null,null,{"$f":"VLOOKUP(H3,Master_Lists!C3:D119,2,FALSE)","v":"HUKUOKA UNYU SHIKYOKU-CHO"}]
[null,"自動車の種別",null,null,null,null,"Category"]
[null,"Category",null,"普　通",null,null,"→",{"$f":"VLOOKUP(D5,Master_Lists!G26:H28,2,FALSE)","v":"MEDIUM"}]
[null,"自家用・事業用の別／適否",null,null,null,null,"Private / Commercial"]
[null,"Private or Commercial",null,"自家用",null,null,"→",{"$f":"VLOOKUP(D7,Master_Lists!G33:H34,2,FALSE)","v":"PRIVATE"}]
[null,"車体の形状",null,null,null,null,"Style of Vehicle",null,null,null,null,"Purpose of Use"]
[null,"Style of Vehicle",null,"箱型",null,null,"→",{"$f":"VLOOKUP(D9,Master_Lists!G3:H22,2,FALSE)","v":"SEDAN"},null,null,null,{"$f":"VLOOKUP(H9,Master_Lists!H3:I22,2,FALSE)","v":"Passenger"}]
[null,"燃料の種別",null,null,null,null,"Fuel"]
[null,"Fuel",null,"ガソリン",null,null,"→",{"$f":"VLOOKUP(D11,Master_Lists!G40:H41,2,FALSE)","v":"PETROL"}]
[null,"DATA Entry Form"]
[null,"登録年月日／交付年月日",null,null,null,null,"Last Registered Date",null,null,null,"Last owner's name"]
[null,"①","Last Reg.Date","平成",null,null,"Year",null,"Month","Day"]
[null,null,null,36,24,15,"→",{"$f":"D15+1988","v":2024},{"$f":"VLOOKUP(E15,Master_Lists!F46:G57,2,FALSE)","v":{"$error":"#N/A"}},{"$f":"F15","v":15},"Put 3 digits from 001 to 100"]
[null,2,null,null,null,null,"First Registered Month",null,null,null,null,"→",{"$f":"VLOOKUP(K16,Master_Names!B3:C102,2,FALSE)","v":{"$error":"#N/A"}}]
[null,"②","First Reg. Month / Year","平成",null,null,"Year",null,"Month"]
[null,null,null,22,8,null,"→",{"$f":"D18+1988","v":2010},{"$f":"VLOOKUP(E18,Master_Lists!F46:G57,2,FALSE)","v":"August,"}]
[null,"有効期間の満了する日",null,null,null,null,"EXPIRY DATE"]
[null,"③","Expiry Date","平成",null,null,"Year",null,"Month","Day"]
[null,null,null,36,10,23,"→",{"$f":"D21+1988","v":2024},{"$f":"VLOOKUP(E21,Master_Lists!F46:G57,2,FALSE)","v":"October,"},{"$f":"F21","v":23},"Last user's name"]
[null,"(Date of Issued)",null,null,null,null,"Date",null,null,null,"Put 3 digits from 001 to 100"]
[null,"④","Date","平成",null,null,"Year",null,"Month","Day",null,"→",{"$f":"VLOOKUP(K23,Master_Names!B3:C102,2,FALSE)","v":{"$error":"#N/A"}}]
[null,null,null,36,4,24,"→",{"$f":"D24+1988","v":2024},{"$f":"VLOOKUP(E24,Master_Lists!F46:G57,2,FALSE)","v":"April,"},{"$f":"F24","v":24}]

{"sheet":"KANA-Palette","index":3,"n_rows":12,"n_cols":15,"rows_kept":12,"cut":false,"hidden":false,"merged":[]}
[]
[null,"あ","A",null,"か","KA",null,"さ","SA",null,"た","TA",null,"な","NA"]
[null,"い","I",null,"き","KI",null,"し","SHI",null,"ち","CHI",null,"に","NI"]
[null,"う","U",null,"く","KU",null,"す","SU",null,"つ","TU",null,"ぬ","NU"]
[null,"え","E",null,"け","KE",null,"せ","SE",null,"て","TE",null,"ね","NE"]
[null,"お","O",null,"こ","KO",null,"そ","SO",null,"と","TO",null,"の","NO"]
[]
[null,"は","HA",null,"ま","MA",null,"や","YA",null,"ら","RA",null,"わ","WA"]
[null,"ひ","HI",null,"み","MI",null,"ゆ","YU",null,"り","RI",null,"を","WO"]
[null,"ふ","FU",null,"む","MU",null,"よ","YO",null,"る","RU",null,"ん","N"]
[null,"へ","HE",null,"め","ME",null,null,null,null,"れ","RE"]
[null,"ほ","HO",null,"も","MO",null,null,null,null,"ろ","RO"]

{"sheet":"Master_Lists","index":4,"n_rows":119,"n_cols":9,"rows_kept":119,"cut":false,"hidden":false,"merged":[[0,5,0,6],[24,5,24,6],[14,0,16,0],[17,0,18,0],[0,0,0,3],[2,0,8,0],[9,0,10,0],[12,0,13,0],[19,0,22,0],[34,0,39,0],[38,5,38,6],[39,5,40,5],[40,0,46,0],[25,5,27,5],[23,0,29,0],[30,0,33,0],[31,5,31,6],[32,5,33,5],[87,0,88,0],[47,0,49,0],[50,0,53,0],[54,0,56,0],[57,0,58,0],[59,0,60,0],[61,0,62,0],[65,0,67,0],[68,0,69,0],[70,0,73,0],[74,0,81,0],[82,0,85,0],[116,0,117,0],[90,0,91,0],[94,0,95,0],[97,0,98,0],[100,0,101,0],[106,0,109,0],[111,0,112,0]]}
["運輸支局一覧"]
["都道府県","表示文字","No. Plate","Author Name",null,"Code","車体の形状","Style of Vehicle","Purpose of use"]
["北海道","札幌","SAPPORO","SAPPORO UNYU SHIKYOKU-CHO",null,"001","箱型","SEDAN","Passenger"]
[null,"函館","HAKODATE","HAKODATE UNYU SHIKYOKU-CHO",null,"002","幌型","CONVERTIBLE","Passenger"]
[null,"帯広","OBIHIRO","OBIHIRO UNYU SHIKYOKU-CHO",null,"003","ステ－ションワゴン","STATION WAGON","Passenger"]
[null,"室蘭","MURORAN","MURORAN UNYU SHIKYOKU-CHO",null,"013","リヤ－エンジン","REAR ENGINE","BUS"]
[null,"釧路","KUSHIRO","KUSHIRO UNYU SHIKYOKU-CHO",null,"011","ボンネット","BONNET","CARGO"]
[null,"旭川","ASAHIKAWA","ASAHIKAWA UNYU SHIKYOKU-CHO",null,"012","キャブオ－バ－","CABOVER","CARGO"]
[null,"北見","KITAMI","KITAMI UNYU SHIKYOKU-CHO",null,"021","バン","VAN","CARGO"]
["青森","青森","AOMORI","AOMORI UNYU SHIKYOKU-CHO",null,"022","ダンプ","DUMP","CARGO"]
[null,"八戸","HACHINOHE","AOMORI UNYU SHIKYOKU-CHO",null,"023","ピックアップ","PICK UP","CARGO"]
["秋田","秋田","AKITA","AKITA UNYU SHIKYOKU-CHO",null,"520","救急車","AMBULANCE","SPECIAL"]
["山形","山形","YAMAGATA","YAMAGATA UNYU SHIKYOKU-CHO",null,"523","消防車","FIRE TRUCK","SPECIAL"]
[null,"庄内","SHONAI","YAMAGATA UNYU SHIKYOKU-CHO",null,"522","警察車","POLICE VAN","SPECIAL"]
["岩手","岩手","IWATE","IWATE UNYU SHIKYOKU-CHO",null,"570","公共応急作業車","PUBLIC FIRST-AID SERVICE VEHICLE","SPECIAL"]
[null,"平泉","HIRAIZUMI","IWATE UNYU SHIKYOKU-CHO",null,"623","教習車","DRIVING SCHOOL VEHICLE","SPECIAL"]
[null,"盛岡","MORIOKA","IWATE UNYU SHIKYOKU-CHO",null,"632","冷蔵冷凍車","FREEZER TRUCK","SPECIAL"]
["宮城","宮城","MIYAGI","MIYAGI UNYU SHIKYOKU-CHO",null,"531","車いす移動車","WHEEL CHAIR TRANSFER VEHICLE","SPECIAL"]
[null,"仙台","SENDAI","MIYAGI UNYU SHIKYOKU-CHO",null,"642","清掃車","RUBBISH COMPACTOR","SPECIAL"]
["福島","福島","FUKUSHIMA","FUKUSHIMA UNYU SHIKYOKU-CHO",null,"671","高所作業車","HEIGH PLACE SERVICE VEHICLE","SPECIAL"]
[null,"会津","AIZU","FUKUSHIMA UNYU SHIKYOKU-CHO",null,"610","キャンピング車","CAMPING VEHICLE","SPECIAL"]
[null,"郡山","KORIYAMA","FUKUSHIMA UNYU SHIKYOKU-CHO",null,"651","放送宣伝車","BROADCASTING ON-AIR VEHICLE","SPECIAL"]
[null,"いわき","IWAKI","FUKUSHIMA UNYU SHIKYOKU-CHO"]
["東京","品川","SHINAGAWA","TOKYO UNYU SHIKYOKU-CHO"]
[null,"練馬","NERIMA","TOKYO UNYU SHIKYOKU-CHO",null,"自動車の種別",null,"Category"]
[null,"杉並","SUGINAMI","TOKYO UNYU SHIKYOKU-CHO",null,null,"小　型","SMALL"]
[null,"世田谷","SETAGAYA","TOKYO UNYU SHIKYOKU-CHO",null,null,"普　通","MEDIUM"]
[null,"足立","ADACHI","TOKYO UNYU SHIKYOKU-CHO",null,null,"軽自動車","LIGHT-DUTY VEHICLE"]
[null,"多摩","TAMA","TOKYO UNYU SHIKYOKU-CHO"]
[null,"八王子","HACHIOUJI","TOKYO UNYU SHIKYOKU-CHO"]
["神奈川","横浜","YOKOHAMA","KANAGAWA UNYU SHIKYOKU-CHO"]
[null,"川崎","KAWASAKI","KANAGAWA UNYU SHIKYOKU-CHO",null,"自家用・事業用の別／適否",null,"Private or Commercial"]
[null,"相模","SAGAMI","KANAGAWA UNYU SHIKYOKU-CHO",null,null,"自家用","PRIVATE"]
[null,"湘南","SHONAN","KANAGAWA UNYU SHIKYOKU-CHO",null,null,"事業用","COMMERCIAL"]
["千葉","千葉","CHIBA","CHIBA UNYU SHIKYOKU-CHO"]
[null,"習志野","NARASHINO","CHIBA UNYU SHIKYOKU-CHO"]
[null,"成田","NARITA","CHIBA UNYU SHIKYOKU-CHO"]
[null,"柏","KASHIWA","CHIBA UNYU SHIKYOKU-CHO"]
[null,"袖ヶ浦","SODEGAURA","CHIBA UNYU SHIKYOKU-CHO",null,"燃料の種別",null,"Fuel"]
[null,"野田","NODA","CHIBA UNYU SHIKYOKU-CHO",null,null,"ガソリン","PETROL"]
["埼玉","大宮","OMIYA","SAITAMA UNYU SHIKYOKU-CHO",null,null,"軽油","DIESEL"]
[null,"川口","KAWAGUCHI","SAITAMA UNYU SHIKYOKU-CHO"]
[null,"越谷","KOSHIGAYA","SAITAMA UNYU SHIKYOKU-CHO"]
[null,"川越","KAWAGOE","SAITAMA UNYU SHIKYOKU-CHO",null,"M","Month"]
[null,"春日部","KASUKABE","SAITAMA UNYU SHIKYOKU-CHO"]
[null,"所沢","TOKOROZAWA","SAITAMA UNYU SHIKYOKU-CHO",null,1,"January,"]
[null,"熊谷","KUMAGAYA","SAITAMA UNYU SHIKYOKU-CHO",null,2,"February,"]
["茨城","水戸","MITO","IBARAGI UNYU SHIKYOKU-CHO",null,3,"March,"]
[null,"つくば","TSUKUBA","IBARAGI UNYU SHIKYOKU-CHO",null,4,"April,"]
[null,"土浦","TSUCHIURA","IBARAGI UNYU SHIKYOKU-CHO",null,5,"May,"]
["栃木","栃木","TOCHIGI","TOCHIGI UNYU SHIKYOKU-CHO",null,6,"June,"]
[null,"那須","NASU","TOCHIGI UNYU SHIKYOKU-CHO",null,7,"July,"]
[null,"とちぎ","TOCHIGI","TOCHIGI UNYU SHIKYOKU-CHO",null,8,"August,"]
[null,"宇都宮","UTSUNOMIYA","TOCHIGI UNYU SHIKYOKU-CHO",null,9,"September,"]
["群馬","群馬","GUNMA","GUNMA UNYU SHIKYOKU-CHO",null,10,"October,"]
[null,"前橋","MAEHASHI","GUNMA UNYU SHIKYOKU-CHO",null,11,"November,"]
[null,"高崎","TAKASAKI","GUNMA UNYU SHIKYOKU-CHO",null,12,"December,"]
["山梨","山梨","YAMANASHI","YAMANASHI UNYU SHIKYOKU-CHO"]
[null,"富士山","FUJISAN","YAMANASHI UNYU SHIKYOKU-CHO"]
["新潟","新潟","NIIGATA","NIIGATA UNYU SHIKYOKU-CHO"]
[null,"長岡","NAGAOKA","NIIGATA UNYU SHIKYOKU-CHO"]
["石川","石川","ISHIKAWA","ISHIKAWA UNYU SHIKYOKU-CHO"]
[null,"金沢","KANAZAWA","ISHIKAWA UNYU SHIKYOKU-CHO"]
["富山","富山","TOYAMA","TOYAMA UNYU SHIKYOKU-CHO"]
["福井","福井","FUKUI","FUKUI UNYU SHIKYOKU-CHO"]
["長野","長野","NAGANO","NAGANO UNYU SHIKYOKU-CHO"]
[null,"諏訪","SUWA","NAGANO UNYU SHIKYOKU-CHO"]
[null,"松本","MATSUMOTO","NAGANO UNYU SHIKYOKU-CHO"]
["岐阜","岐阜","GIFU","GIFU UNYU SHIKYOKU-CHO"]
[null,"飛騨","HIDA","GIFU UNYU SHIKYOKU-CHO"]
["静岡","静岡","SHIZUOKA","SHIZUOKA UNYU SHIKYOKU-CHO"]
[null,"伊豆","IZU","SHIZUOKA UNYU SHIKYOKU-CHO"]
[null,"沼津","NUMAZU","SHIZUOKA UNYU SHIKYOKU-CHO"]
[null,"浜松","HAMAMATSU","SHIZUOKA UNYU SHIKYOKU-CHO"]
["愛知","名古屋","NAGOYA","AICHI UNYU SHIKYOKU-CHO"]
[null,"岡崎","OKAZAKI","AICHI UNYU SHIKYOKU-CHO"]
[null,"豊田","TOYOTA","AICHI UNYU SHIKYOKU-CHO"]
[null,"一宮","ICHIMIYA","AICHI UNYU SHIKYOKU-CHO"]
[null,"春日井","KASUGAI","AICHI UNYU SHIKYOKU-CHO"]
[null,"尾張小牧","OWARIKOMAKI","AICHI UNYU SHIKYOKU-CHO"]
{"$rows_left_out":40}
{"sheet":"Master_ProductCode","index":5,"n_rows":1002,"n_cols":4,"rows_kept":1002,"cut":false,"hidden":false,"merged":[[1,1,2,1],[1,2,1,3]]}
[]
[null,"Code","Name (Car / Products)"]
[null,null,"English","Japanese"]
[null,"001","AICHI","アイチ"]
[null,"002","ASAHI","旭"]
[null,"003","ANTICO","アンチコ"]
[null,"004","ARROW","アロ－"]
[null,"005","N/A"]
[null,"006","N/A"]
[null,"007","N/A"]
[null,"008","N/A"]
[null,"009","N/A"]
[null,"010","N/A"]
[null,"011","ISHIKAWAJIMACALLING","石川島コ－リング"]
[null,"012","ISUZU","いすゞ"]
[null,"013","ISUZUFULLHALF","いすゞフルハ－フ"]
[null,"014","ISEKI","ヰセキ"]
[null,"015","ICHIHARA","イチハラ"]
[null,"016","IWATEFUJI","岩手富士"]
[null,"017","ISHIKAWAJIMAKENKI","石川島建機"]
[null,"018","IWAFUJI","イワフジ"]
[null,"019","N/A"]
[null,"020","N/A"]
[null,"021","N/A"]
[null,"022","N/A"]
[null,"023","N/A"]
[null,"024","N/A"]
[null,"025","N/A"]
[null,"026","N/A"]
[null,"027","N/A"]
[null,"028","N/A"]
[null,"029","N/A"]
[null,"030","N/A"]
[null,"031","ESUKO","エスコ"]
[null,"032","NST","ＮＳＴ"]
[null,"033","NTK","ＮＴＫ"]
[null,"034","HK","エッチケ－"]
[null,"035","SN","ＳＮ"]
[null,"036","N/A"]
[null,"037","N/A"]
[null,"038","N/A"]
[null,"039","N/A"]
[null,"040","N/A"]
[null,"041","OAC","オ－エ－シ－"]
[null,"042","OHTA","オオタ"]
[null,"043","OHTUKABARMIYA","大塚バ－ミヤ"]
[null,"044","OHARA","大原"]
[null,"045","OHARATEKKO","大原鉄工"]
[null,"046","ORIENT","オリエント"]
[null,"047","N/A"]
[null,"048","N/A"]
[null,"049","N/A"]
[null,"050","N/A"]
[null,"051","KATO","カトウ"]
[null,"052","KAWASAKI","カワサキ"]
[null,"053","KAWANISHI","川西"]
[null,"054","KAWASAKI","川崎"]
[null,"055","KANTO","カントウ"]
[null,"056","N/A"]
[null,"057","N/A"]
[null,"058","N/A"]
[null,"059","N/A"]
[null,"060","N/A"]
[null,"061","CALLABELAIR","キャラベルエア"]
[null,"062","KYUSHUANZEN","キュウシュウアンゼン"]
[null,"063","KYOEI","共栄"]
[null,"064","KYOSAN","協三"]
[null,"065","KYORITSU","共立"]
[null,"066","KINSAN","金三"]
[null,"067","GINREI","ギンレイ"]
[null,"068","CATERPILLAR","キャタピラ－"]
[null,"069","CABTON","キャブトン"]
[null,"070","KYOKUTO","極東"]
[null,"071","KUBOTA","クボタ"]
[null,"072","KUBOTAFIAT","クボタフィアット"]
[null,"073","KUREHA","クレハ"]
[null,"074","KUROGANE","くろがね"]
[null,"075","N/A"]
[null,"076","N/A"]
[null,"077","N/A"]
{"$rows_left_out":923}
{"sheet":"Master_Names","index":6,"n_rows":102,"n_cols":3,"rows_kept":102,"cut":false,"hidden":false,"merged":[]}
[]
[null,"No.","Name - Dammy"]
[null,"001","ARAI  TERUO"]
[null,"002","WAKABAYASHI  YOSHIFUMI"]
[null,"003","TAKEMASA  YOSHIYUKI"]
[null,"004","KOMADA  MANABU"]
[null,"005","ADACHI  TETSUYA"]
[null,"006","KANDA  SHOZO"]
[null,"007","SUZUKI  TOMOATSU"]
[null,"008","TANAKA  KIYOKATSU"]
[null,"009","YOSHIKAWA  AKIRA"]
[null,"010","NOMURA  MASASHI"]
[null,"011","IUCHI  EIJI"]
[null,"012","INOUE  KATSUMI"]
[null,"013","NISHIDA  YUJI"]
[null,"014","TOMONO  MUNEYUKI"]
[null,"015","TANABE  TOSHIKATSU"]
[null,"016","SAWADA  TAKESHI"]
[null,"017","NAKAMURA  TAKATOSHI"]
[null,"018","GOTO  MASAYUKI"]
[null,"019","TOIDA  AKIHIKO"]
[null,"020","FUJITA  KAZUHIKO"]
[null,"021","KOYAMA  SHOJI"]
[null,"022","FUJIMOTO  YOSHIFUSA"]
[null,"023","SAIKI  HIROYUKI"]
[null,"024","NEMOTO  TOYOKO"]
[null,"025","UCHIYAMA  MASAMI"]
[null,"026","UCHIYAMA  TAKAHARU"]
[null,"027","KAWAMURA  KAZUSHI"]
[null,"028","WATABE  KOICHI"]
[null,"029","HASHIMOTO ICHIRO"]
[null,"030","KAWAGUSHI  MASAKI"]
[null,"031","MINEGISHI  KENICHI"]
[null,"032","SUZUKI  MOTOSHI"]
[null,"033","YAMAGUCHI  NAOMI"]
[null,"034","YOSHIDA  MANABU"]
[null,"035","TOKUMOTO  MAKOTO"]
[null,"036","NOBUNAGA  NORIYUKI"]
[null,"037","OKAMOTO  JINSAKU"]
[null,"038","OTA  MASAHARU"]
[null,"039","SAKAMOTO  MANABU"]
[null,"040","HOZUMI  HIROAKI"]
[null,"041","MATSUDA  KUNIAKI"]
[null,"042","KITAGUCHI  TOSHITSUGU"]
[null,"043","ARIUCHI  YUKO"]
[null,"044","IKEDA  TSUTOMU"]
[null,"045","MORIMURA  KENJI"]
[null,"046","YAMAMOTO  HIROO"]
[null,"047","KOBAYASHI  TAKASHI"]
[null,"048","WADA  YUMIE"]
[null,"049","ARIMURA  HIROKO"]
[null,"050","KAGAWA  HIDEAKI"]
[null,"051","TAKIGAWA  YUSUKE"]
[null,"052","FUKUDA  JUNYA"]
[null,"053","WATANABE  SATOSHI"]
[null,"054","OKABE  YUKINORI"]
[null,"055","TERAUCHI  TORU"]
[null,"056","YOKOMIZO  KEIICHIRO"]
[null,"057","OZAWA  TOSHIRO"]
[null,"058","TANAHASHI  KOICHI\\"]
[null,"059","NANAO  JUNYA"]
[null,"060","HONDA  YUUKI"]
[null,"061","NAKAGAWA  SHOICHI"]
[null,"062","YOSHIKAWA  FUMIHIRO"]
[null,"063","ISHIDA  MASAO"]
[null,"064","CHIBA TETSURO"]
[null,"065","IIYAMA  KAZUE"]
[null,"066","ISHII  KOJI"]
[null,"067","MATSUO  SHINJI"]
[null,"068","NAKANISHI  TAKAO"]
[null,"069","TERAUCHI  KIYOKO"]
[null,"070","NISHIKIORI  SHUICHIRO"]
[null,"071","NAESHIRO HIDEJI"]
[null,"072","HIROSE TAKAKO"]
[null,"073","KAMISHIMA KEIGO"]
[null,"074","OGATA KEIKO"]
[null,"075","KIMISHIMA ICHIRO"]
[null,"076","KIDO TAKAMUNE"]
[null,"077","SUZUKI KYOUTARO"]
[null,"078","DAICHI KEIZOU"]
{"$rows_left_out":22}